program: Gaussian 09
title: 000254386
version: EM64L-G09RevD.01
frameworkgroup: C1[X(C14H26O5)]
method: RPBEPBE
basis: SDD
operation: Freq
keyword: #pfreq=noraman
keyword: PBEPBE/SDD
title: #p freq=noraman PBEPBE/SDD
converged: YES YES NO NO
title: Mulliken charges:
elementType: O O O O O C C C C C C C C C C C C C C H H H H H H H H H H H H H H H H H H H H H H H H H H
charge: -0.290079 -0.253784 -0.228457 -0.449059 -0.251913 -0.371322 -0.417493 -0.365666 0.042476 -0.356021 -0.356024 -0.720983 -0.695362 0.270776 -0.095171 -0.701779 0.240970 -0.146101 -0.658891 0.192053 0.219365 0.195475 0.211697 0.185621 0.190736 0.236932 0.192252 0.189659 0.193967 0.194707 0.248257 0.219943 0.221367 0.210419 0.211149 0.215233 0.265051 0.235296 0.237148 0.240633 0.242402 0.227716 0.230671 0.239472 0.356662
chargesum: 0.00000
title: Mulliken charges with hydrogens summed into heavy atoms:
elementType: O O O O O C C C C C C C C C C C C C C
charge: -0.290079 -0.253784 -0.228457 -0.092396 -0.251913 0.040096 -0.010321 0.010691 0.279408 0.025890 0.032651 -0.031417 -0.058562 0.270776 0.169879 0.011298 0.240970 0.096301 0.038968
polarizability: 1.93296784e+02 -2.13903279e+00 1.71848652e+02 -3.96208184e+00 3.41750243e+00 1.43672578e+02
1716.lowfreq: -16.4808 -8.1835 -5.1734 -2.5916 -0.0006 0.0002 0.0003 20.4414 30.6570
frequency: -9.9749 18.9151 30.2281 32.2882 42.1676 47.3584 56.6195 77.8665 89.5138 100.1106 108.9376 121.9389 134.8884 153.1672 168.6633 205.7528 208.8333 219.3185 222.1835 225.4956 231.8397 250.4329 259.2797 288.8184 319.8390 334.5997 352.2732 360.8346 392.7352 405.0469 433.7679 475.9470 489.8528 521.2041 630.4643 653.5482 696.7024 716.2059 720.8784 729.4232 759.8967 797.0358 817.8469 826.8499 871.6390 878.1427 885.8648 911.0941 921.3325 960.6357 995.3492 1006.9547 1015.9037 1029.5071 1030.9712 1066.0890 1068.1570 1072.7324 1076.9754 1082.1949 1091.7652 1117.1401 1121.8812 1131.1012 1151.2552 1163.9495 1171.3897 1198.2790 1228.8194 1246.6609 1247.1734 1274.6614 1280.5418 1283.4853 1287.3730 1295.3318 1300.0003 1310.3512 1315.0728 1329.3311 1343.8822 1354.1545 1364.3191 1378.4903 1385.0924 1387.1142 1387.4708 1391.2711 1446.8583 1460.6241 1462.0889 1464.1662 1465.7310 1467.2509 1469.8929 1472.6697 1475.2477 1475.3996 1478.3170 1481.2065 1487.9658 1624.5028 1645.6760 2949.5756 2955.7994 2965.7653 2968.7767 2971.8251 2975.5034 2988.1570 2990.1771 2998.7059 3003.1903 3006.2450 3014.9144 3025.1970 3033.5265 3039.9335 3051.4402 3051.9509 3068.6023 3071.0840 3087.4460 3099.2374 3104.6402 3110.6090 3111.9437 3116.1454 3497.6689
redmass: 4.6929 2.7465 4.2437 2.0886 3.5660 5.0865 3.3256 3.5517 8.9945 2.8939 1.7819 3.6275 2.5887 2.7911 2.7756 1.3045 1.1631 1.1308 2.6709 1.1297 2.6342 3.1785 3.5698 2.5318 4.0654 3.0567 3.3065 2.1744 3.0739 3.3867 2.8866 2.7475 3.3128 3.7381 5.7438 5.1131 4.3797 2.4890 1.2313 1.2729 1.8219 1.6628 3.1979 4.2388 1.4983 2.2135 2.0288 1.9685 2.5242 1.2925 2.7567 1.6397 2.0352 2.1021 2.5582 2.3534 2.6708 2.2746 2.2862 1.9306 1.9171 2.3967 2.2293 2.6126 2.3000 2.5907 2.1455 1.5949 1.3175 1.4548 1.3911 1.2920 1.0977 1.4197 1.1435 1.0984 1.3031 1.2951 1.3478 1.3428 1.4936 1.6613 1.7193 1.2720 1.2336 1.2168 1.2252 1.2221 1.0810 1.0577 1.0681 1.0724 1.0566 1.0490 1.0584 1.0732 1.0478 1.0429 1.0513 1.0805 1.0888 10.5682 10.9590 1.0589 1.0591 1.0607 1.0604 1.0364 1.0608 1.0959 1.0364 1.0342 1.0995 1.0350 1.0939 1.0953 1.1010 1.0845 1.1029 1.0858 1.1007 1.0993 1.0987 1.1008 1.1002 1.1011 1.1015 1.1004 1.0651
irintensity: 0.5459 0.0792 1.4316 0.1205 0.6154 3.5248 1.5513 0.6353 1.6908 0.3960 0.2223 0.7338 0.3493 2.0804 0.7112 0.1404 0.1881 0.2240 6.6762 0.0023 0.8668 9.5372 0.6259 56.5486 4.7864 11.4721 67.3960 51.9953 5.3134 6.4882 1.3734 4.9515 1.4085 0.7061 11.0860 13.8115 7.4155 1.7882 14.7630 0.7125 2.2843 11.7731 6.8023 3.7327 5.4451 4.2619 0.9681 5.8895 18.6074 0.8004 21.6418 16.0599 60.3995 17.3173 4.0069 80.6368 85.5913 148.7781 203.5031 12.4019 124.5277 67.0573 5.7540 16.7648 224.7987 60.5149 12.4733 2.3465 5.3354 55.7897 24.2254 0.1900 0.3130 4.9435 1.4271 0.8648 1.3892 25.7632 4.1983 1.4240 0.6892 1.6994 6.3674 18.0302 18.6821 10.3533 16.9801 25.4890 1.8538 19.1312 0.3237 0.7950 6.4395 18.7265 18.0177 3.1984 11.7950 12.8206 14.0545 2.8019 23.0304 181.6784 144.7099 5.7745 5.5184 11.0542 65.7691 37.8251 71.4347 4.8176 24.4374 11.6614 1.8178 13.1941 1.1563 15.9319 17.6421 3.9550 84.5582 15.1732 96.0411 56.1944 37.7807 21.4607 26.0160 16.9446 22.5622 15.9258 16.6360
temp: 298.150 k
press: 1.00000 atm
elementType: 8 8 8 8 8 6 6 6 6 6 6 6 6 6 6 6 6 6 6 1 1 1 1 1 1 1 1 1 1 1 1 1 1 1 1 1 1 1 1 1 1 1 1 1 1
symmnumber: 1
zpe: 1003524.1 jmol-1
zpe.correction: 0.382222 hartree
zpe.thermalcorrener: 0.405574 hartree
zpe.thermalcorrenthalpy: 0.406519 hartree
zpe.thermalcorrgfe: 0.326746 hartree
zpe.sumelectzpe: -923.671657 hartree
zpe.sumelectthermal: -923.648305 hartree
zpe.sumelectthermalent: -923.647361 hartree
zpe.sumelectthermalfe: -923.727133 hartree
dipole: -2.7932 3.9194 1.1527
dipole: 4.9490
quadrupole: -121.7667 -121.0943 -112.5794
quadrupole: 7.7320 5.5935 1.1301
quadrupole: -3.2866 -2.6142 5.9007 7.7320 5.5935 1.1301
hfenergy: -924.0538792 hartree
pointgroup: C01 [X(C14H26O5)]
dipole: 1.2067369 -1.3965345 0.6201271 debye
polarizability: 193.2108489|0.2398955|170.8434131|5.6825816|-5.5756134|144.7637519 unknown
InChI: InChI=1S/C14H26O5/c1-5-6-7-8-9-10(2)18-14(17)12(4)19-13(16)11(3)15/h10-12,15H,5-9H2,1-4H3
charge 0 multiplicity 1
45 atoms
O  0.235237 -1.494019 0.455987
O  -3.108944 -0.055833 0.864202
O  -1.557241 -1.37053 -1.042688
O  -4.504836 2.829147 -0.883286
O  -2.056909 1.764077 -0.15434
C  2.835841 -0.229975 -0.378251
C  2.553528 -1.740733 -0.229102
C  4.283331 0.14763 0.008496
C  1.118675 -2.143763 -0.592765
C  4.583048 1.654438 -0.156186
C  6.028678 2.03584 0.237145
C  0.858077 -3.654611 -0.568818
C  6.321354 3.542159 0.065994
C  -1.061884 -1.178156 0.088033
C  -1.78735 -0.571251 1.304339
C  -2.063834 -1.607009 2.399811
C  -3.089852 1.093528 0.084299
C  -4.472132 1.426375 -0.47741
C  -4.80031 0.477489 -1.655217
H  2.643532 0.078942 -1.426833
H  2.123911 0.337735 0.251893
H  3.238238 -2.314801 -0.886354
H  2.763062 -2.06526 0.80964
H  4.995934 -0.437019 -0.611143
H  4.470945 -0.149772 1.061673
H  0.815889 -1.71513 -1.567121
H  3.869843 2.241058 0.459642
H  4.400306 1.952819 -1.209709
H  6.740493 1.447261 -0.377354
H  6.209317 1.739876 1.290807
H  -0.197598 -3.876835 -0.799322
H  1.48488 -4.155029 -1.329279
H  1.108297 -4.079187 0.419643
H  6.171196 3.857515 -0.983947
H  5.646892 4.151297 0.697049
H  7.361694 3.788526 0.347611
H  -1.178785 0.270422 1.68184
H  -2.691209 -2.427234 2.011826
H  -1.110688 -2.024279 2.76429
H  -2.591817 -1.128977 3.241452
H  -5.227568 1.31154 0.318647
H  -4.019901 0.5349 -2.433742
H  -4.871202 -0.568383 -1.310298
H  -5.76386 0.786426 -2.093233
H  -3.580882 3.090289 -1.146321
