program: Gaussian 09
title: 000254374
version: EM64L-G09RevD.01
frameworkgroup: C1[X(C7H16NO5P)]
method: RPBEPBE
basis: SDD
operation: Freq
keyword: #p
keyword: freq=noraman
keyword: PBEPBE/SDD
title: #p freq=noraman PBEPBE/SDD
converged: YES YES NO NO
title: Mulliken charges:
elementType: P O O O O O N C C C C C C C H H H H H H H H H H H H H H H H
charge: 1.298899 -0.506239 -0.528978 -0.617689 -0.194388 -0.204197 0.145196 -0.785408 -0.314259 -0.347535 -0.220141 -0.255363 -0.656659 -0.650234 0.290241 0.264060 0.261382 0.254130 0.258411 0.248047 0.200310 0.228110 0.225457 0.241580 0.206849 0.233855 0.237317 0.219685 0.251069 0.216493
chargesum: 0.00000
title: Mulliken charges with hydrogens summed into heavy atoms:
elementType: P O O O O O N C C C C C C C
charge: 1.298899 -0.506239 -0.528978 -0.617689 -0.194388 -0.204197 0.145196 -0.231107 0.201253 0.158923 0.208279 0.211674 0.021362 0.037012
polarizability: 1.52674998e+02 -3.82411400e+00 1.29276009e+02 1.50725155e+00 -1.43146584e-01 9.86554606e+01
1716.lowfreq: -10.7675 -0.0020 -0.0015 -0.0014 1.5182 10.9727 13.6571 22.6132 27.0956
frequency: 12.6461 22.5367 26.5365 39.7694 47.1215 67.6226 77.7642 84.2845 99.7127 127.7294 140.0742 181.5423 193.1189 222.1740 240.2743 246.3401 279.5133 314.5026 346.9821 380.4794 411.5520 449.0288 464.1029 567.8357 606.6463 655.0917 673.5123 737.6004 761.4288 802.5938 809.5110 835.3936 852.2180 860.5436 881.6732 1013.3559 1015.2994 1021.5709 1043.6058 1066.9926 1077.5699 1092.2296 1104.2314 1130.7364 1145.0254 1150.1978 1226.3934 1246.9619 1254.3105 1258.1073 1272.7421 1293.1053 1310.5737 1353.0818 1354.0300 1360.8460 1391.3446 1393.6455 1425.8990 1430.6932 1453.5429 1455.6336 1461.7309 1465.3362 1475.0161 1481.7439 1486.2279 1491.7053 2962.2603 2985.7894 2995.3995 3010.7563 3012.8644 3020.8033 3027.1664 3035.6675 3073.3634 3078.3993 3082.8853 3092.5308 3094.6255 3106.2282 3110.2798 3117.2072
redmass: 4.0990 10.7522 2.9406 2.7222 4.1644 2.3764 3.1938 2.5444 2.6779 4.5491 3.5349 2.8556 4.0846 2.0393 1.4003 1.7543 3.6917 5.0339 5.0885 4.4592 4.9139 3.8126 4.3846 6.0819 5.5138 7.6212 6.5144 5.1484 1.1591 1.1226 1.0936 1.5975 4.4313 3.4207 3.6532 2.8652 2.4176 2.7224 5.0940 2.9126 2.8740 2.1482 2.2467 1.4256 1.5034 1.3012 3.8077 1.3804 1.1566 1.3793 1.1133 1.1178 1.3603 1.2761 1.2170 1.4518 1.2273 1.2382 1.1059 3.2550 1.1853 1.0399 1.0461 1.0686 1.0564 1.0520 1.0821 1.0823 1.0594 1.0356 1.0365 1.0616 1.0622 1.0602 1.0581 1.1034 1.1021 1.1026 1.0978 1.0983 1.1041 1.1049 1.1017 1.1036
irintensity: 1.0296 0.0433 0.0953 1.4798 3.1303 3.3147 2.0363 2.3788 0.8668 0.8779 7.2716 8.4263 13.8208 1.5137 2.6585 2.3755 20.6797 6.0914 5.8575 10.8287 14.2872 24.4990 15.3511 24.9197 17.9243 36.2943 93.1857 52.4525 20.0661 5.6547 2.1529 7.9208 15.4500 139.3527 125.0213 125.3509 83.3128 100.3044 1.2545 0.5033 54.7842 13.2055 14.2841 4.5914 5.9761 32.0513 96.7990 1.4745 1.0633 4.0706 0.1222 10.5607 12.3801 9.5765 10.3386 12.3974 26.2414 23.3704 4.1810 146.0736 10.3306 10.9850 13.6354 5.0229 2.9235 14.0570 24.0725 0.5086 45.4388 14.3953 21.8378 32.5322 0.5665 2.0200 14.7174 24.9789 0.5555 2.9716 39.5660 24.5226 6.2457 34.4518 30.9753 7.6228
temp: 298.150 k
press: 1.00000 atm
elementType: 15 8 8 8 8 8 7 6 6 6 6 6 6 6 1 1 1 1 1 1 1 1 1 1 1 1 1 1 1 1
symmnumber: 1
zpe: 625223.3 jmol-1
zpe.correction: 0.238135 hartree
zpe.thermalcorrener: 0.256498 hartree
zpe.thermalcorrenthalpy: 0.257443 hartree
zpe.thermalcorrgfe: 0.186832 hartree
zpe.sumelectzpe: -1047.193277 hartree
zpe.sumelectthermal: -1047.174913 hartree
zpe.sumelectthermalent: -1047.173969 hartree
zpe.sumelectthermalfe: -1047.244580 hartree
dipole: -3.7555 0.3656 -5.1844
dipole: 6.4121
quadrupole: -105.9728 -89.9374 -97.9943
quadrupole: -4.9877 -1.8494 1.2913
quadrupole: -8.0046 8.0307 -0.0261 -4.9877 -1.8494 1.2913
hfenergy: -1047.4314115 hartree
pointgroup: C01 [X(C7H16N1O5P1)]
dipole: 1.3701935 0.3667275 -2.0862059 debye
polarizability: 152.683361|-1.6261176|127.6101883|-4.8823893|6.1830111|100.312918 unknown
InChI: InChI=1S/C7H16NO5P/c1-3-12-14(11,13-4-2)7-5-6-8(9)10/h3-7H2,1-2H3
charge 0 multiplicity 1
30 atoms
P  1.086799 0.676973 0.322315
O  1.338289 -1.046788 0.23115
O  2.171652 1.385117 -0.843136
O  1.240272 1.194454 1.816925
O  -5.296948 0.44264 0.334185
O  -4.022106 -1.445474 0.197249
N  -4.205359 -0.179651 0.063592
C  -0.547611 1.006008 -0.528316
C  -1.706344 0.261021 0.166521
C  -3.041718 0.648946 -0.489719
C  1.471984 -1.7215 -1.091136
C  3.499696 1.869527 -0.356057
C  1.945972 -3.142708 -0.798878
C  4.499447 0.722233 -0.183287
H  -0.684014 2.101599 -0.495319
H  -0.434697 0.706286 -1.585351
H  -1.568124 -0.831911 0.095134
H  -1.728897 0.517936 1.241882
H  -3.318597 1.700907 -0.320261
H  -3.029805 0.444116 -1.576416
H  0.486077 -1.727114 -1.60095
H  2.195358 -1.165284 -1.717345
H  3.813586 2.57553 -1.142349
H  3.350255 2.416978 0.593642
H  2.044681 -3.71282 -1.741411
H  2.925076 -3.126157 -0.291283
H  1.226235 -3.664574 -0.146084
H  5.486221 1.128708 0.107577
H  4.170181 0.026224 0.608151
H  4.622738 0.159577 -1.125328
