program: Gaussian 09
title: 000254394
version: EM64L-G09RevD.01
frameworkgroup: C1[X(C17H10ClN3)]
method: RPBEPBE
basis: SDD
operation: Freq
keyword: #p
keyword: freq=noraman
keyword: PBEPBE/SDD
title: #p freq=noraman PBEPBE/SDD
converged: YES YES NO NO
title: Mulliken charges:
elementType: Cl N N N C C C C C C C C C C C C C C C C C H H H H H H H H H H
charge: 0.045872 -0.086770 0.012283 0.013347 0.221512 -0.089756 0.305502 0.334086 0.294984 -0.373091 -0.390023 -0.363443 -0.363976 -0.219437 -0.226938 -0.402624 -0.233174 -0.230591 -0.234670 -0.235809 -0.231070 0.257222 0.258234 0.270876 0.254646 0.236158 0.237996 0.233856 0.233024 0.237531 0.234243
chargesum: 0.00000
title: Mulliken charges with hydrogens summed into heavy atoms:
elementType: Cl N N N C C C C C C C C C C C C C C C C C
charge: 0.045872 -0.086770 0.012283 0.013347 0.221512 -0.089756 0.305502 0.334086 0.294984 -0.115869 -0.131789 -0.092567 -0.109330 0.016721 0.011058 -0.402624 0.000682 0.002434 0.002861 -0.001567 -0.231070
polarizability: 2.99447082e+02 -2.17805460e+00 2.40246484e+02 9.35027793e+00 -2.04430875e+01 1.21177597e+02
1716.lowfreq: -0.0025 -0.0015 -0.0006 4.0714 4.4030 6.1014 36.9638 44.4116 54.5755
frequency: 36.9329 44.4099 54.5580 61.6218 71.6014 100.6797 124.8783 143.2844 182.9501 220.4390 240.0799 256.3270 267.4718 299.6582 351.4290 384.5168 401.4021 405.8942 415.0480 467.4281 483.1921 519.3796 527.1836 581.4845 613.4695 613.9907 621.3850 640.7146 651.9707 677.5272 699.5160 704.2146 753.6371 767.1899 795.0009 799.7894 852.4681 857.0274 873.0795 931.3194 932.8449 980.8562 982.2296 988.5183 989.6299 1000.6707 1001.9894 1006.9846 1021.6722 1037.6547 1051.4135 1085.1502 1088.5672 1133.4094 1158.2225 1175.7312 1177.7384 1194.7308 1197.2202 1222.8169 1293.3496 1319.0654 1324.9431 1364.3534 1373.3407 1380.6209 1429.1805 1433.1831 1458.8368 1468.1528 1488.2378 1492.5795 1583.3257 1584.0902 1608.3353 1610.5529 2182.9160 3131.2301 3132.9124 3137.5778 3142.3576 3148.1957 3155.1151 3158.5964 3165.3080 3172.2205 3174.4778
redmass: 7.3006 4.8797 8.6901 4.6980 4.4694 6.2037 7.0561 13.3232 6.2194 6.3203 6.0998 9.6755 6.7035 7.6477 6.6522 10.1232 2.8990 2.8571 8.5810 8.8857 4.7130 6.3366 6.0405 8.5223 6.5518 6.7995 7.8392 7.4308 7.8264 7.4581 1.7595 1.8238 2.3336 2.2097 4.1982 5.9910 1.2488 1.2429 7.7472 1.3884 1.4151 1.4774 1.4151 5.5662 5.0418 1.3465 1.4365 4.6167 3.2947 2.3395 3.4184 1.6681 1.6566 7.1305 6.1226 1.0541 1.0538 1.1324 1.1172 6.4276 4.5387 1.3986 1.4275 5.0119 6.3476 8.3233 2.5286 2.5678 4.2057 4.6691 2.9382 3.1016 5.8851 5.9984 5.9922 6.0417 12.6353 1.0852 1.0853 1.0881 1.0888 1.0925 1.0933 1.0968 1.0963 1.1018 1.1002
irintensity: 0.0212 0.3014 0.9713 0.2113 0.4223 0.2820 3.3053 2.6314 1.5637 0.3816 2.1414 1.9069 1.2122 1.1441 1.0973 1.2415 0.2369 1.2698 3.4569 4.4651 0.8414 13.5387 9.0663 0.9919 0.9471 7.4845 8.0456 27.5747 5.0087 1.8865 53.1299 61.7489 15.7890 54.6121 3.2590 22.1906 2.0528 1.4659 18.1092 0.4201 3.7515 0.9412 0.3826 2.8958 2.6315 0.1698 0.1003 0.6731 10.3160 12.5283 29.8821 2.6233 9.3049 4.8437 70.5184 0.0284 0.0211 12.6920 1.6872 72.2579 84.7403 2.4071 14.5520 77.9569 1.2226 0.6572 6.4528 31.5577 38.9322 9.4777 0.4266 3.3175 2.1932 0.9437 5.5323 5.5479 1.2865 0.1492 1.0217 0.3908 6.4192 10.9493 24.3103 20.5751 15.9101 16.9394 14.0612
temp: 298.150 k
press: 1.00000 atm
elementType: 17 7 7 7 6 6 6 6 6 6 6 6 6 6 6 6 6 6 6 6 6 1 1 1 1 1 1 1 1 1 1
symmnumber: 1
zpe: 579203.5 jmol-1
zpe.correction: 0.220607 hartree
zpe.thermalcorrener: 0.237634 hartree
zpe.thermalcorrenthalpy: 0.238578 hartree
zpe.thermalcorrgfe: 0.174314 hartree
zpe.sumelectzpe: -1276.656507 hartree
zpe.sumelectthermal: -1276.639480 hartree
zpe.sumelectthermalent: -1276.638536 hartree
zpe.sumelectthermalfe: -1276.702800 hartree
dipole: 5.8469 2.7579 -0.1211
dipole: 6.4658
quadrupole: -129.1368 -131.5957 -121.7604
quadrupole: 3.3725 3.0752 -4.7670
quadrupole: -1.6391 -4.0981 5.7372 3.3725 3.0752 -4.7670
hfenergy: -1276.8771142 hartree
pointgroup: C01 [X(C17H10Cl1N3)]
dipole: -2.1629167 1.331568 0.1410337 debye
polarizability: 295.9288194|-11.372026|227.8554051|24.7488531|40.7595569|137.0869387 unknown
InChI: InChI=1S/C17H10ClN3/c18-17-14(11-19)15(12-7-3-1-4-8-12)16(20-21-17)13-9-5-2-6-10-13/h1-10H
charge 0 multiplicity 1
31 atoms
Cl 4.349851 -2.129343 -0.012308
N  0.43597 -2.453229 -0.617426
N  1.785138 -2.690144 -0.561971
N  3.958307 1.478862 0.697336
C  0.774578 -0.093594 0.039287
C  -0.074846 -1.210217 -0.288749
C  0.268584 1.301108 0.187396
C  -1.564802 -1.168198 -0.297909
C  2.171012 -0.370605 0.138467
C  -0.513752 1.882465 -0.847388
C  0.584493 2.076599 1.334232
C  -2.269496 -1.961078 -1.244486
C  -2.302527 -0.421288 0.660438
C  -0.964988 3.213207 -0.735945
C  0.117515 3.403321 1.449486
C  2.601325 -1.700311 -0.147327
C  -3.679089 -1.984468 -1.250075
C  -3.712419 -0.456323 0.659056
C  -0.655567 3.976963 0.414365
C  -4.406831 -1.230229 -0.29978
C  3.135735 0.6492 0.444277
H  -0.75928 1.294538 -1.738006
H  1.180087 1.641054 2.144042
H  -1.697521 -2.560634 -1.958752
H  -1.781212 0.173821 1.416101
H  -1.556992 3.653547 -1.545181
H  0.363007 3.987466 2.342523
H  -4.208956 -2.593394 -1.99042
H  -4.26815 0.117189 1.408694
H  -1.010824 5.009472 0.500945
H  -5.502248 -1.250153 -0.302021
