program: Gaussian 09
title: 000250347
version: EM64L-G09RevD.01
frameworkgroup: C1[X(C14H14N2O2)]
method: RPBEPBE
basis: SDD
operation: Freq
keyword: #p
keyword: freq=noraman
keyword: PBEPBE/SDD
title: #p freq=noraman PBEPBE/SDD
converged: YES YES NO NO
title: Mulliken charges:
elementType: O O N N C C C C C C C C C C C C C C H H H H H H H H H H H H H H
charge: -0.183338 -0.199882 -0.214962 -0.366398 -0.362863 0.321394 0.147569 0.122317 -0.556651 0.216108 0.126924 0.147208 -0.801094 -0.376121 -0.360063 -0.662563 -0.277359 -0.227676 0.241395 0.286655 0.266385 0.348042 0.238365 0.248172 0.237189 0.228985 0.234715 0.239424 0.250612 0.243236 0.222570 0.221705
chargesum: 0.00000
title: Mulliken charges with hydrogens summed into heavy atoms:
elementType: O O N N C C C C C C C C C C C C C C
charge: -0.183338 -0.199882 -0.214962 -0.018356 -0.121468 0.321394 0.147569 0.122317 -0.003610 0.216108 0.126924 0.147208 -0.077369 -0.147136 -0.125348 0.070710 -0.054789 -0.005971
polarizability: 1.97198965e+02 9.13014506e+00 1.94233465e+02 -6.63721099e+00 1.99643745e+00 1.11857375e+02
1716.lowfreq: -6.9039 -2.7037 -0.0007 -0.0004 0.0005 6.8304 23.4650 41.5104 62.7611
frequency: 23.4410 41.3775 62.7394 69.3761 117.5595 133.1874 142.5555 151.3770 165.7790 188.9340 225.7873 265.1062 307.6145 308.2758 369.6717 379.9464 438.6792 456.7768 493.0848 528.9582 554.1328 557.3424 577.9955 590.8639 605.0888 627.6471 661.2617 672.8793 725.6820 749.9028 757.2647 762.4418 777.0949 844.4960 850.3110 877.0940 902.1419 929.5464 936.4378 970.9175 1004.3441 1022.7112 1026.7803 1041.2923 1062.3236 1118.5498 1127.7976 1134.8369 1153.3903 1162.9695 1166.3207 1193.4427 1212.1091 1257.7255 1262.3410 1283.5322 1298.9883 1325.5853 1334.4281 1369.3989 1393.5823 1413.3200 1416.2130 1442.1826 1445.6608 1461.0228 1465.8215 1471.4988 1479.8478 1485.3349 1496.9539 1580.4399 1586.6601 1625.7162 1664.7101 1700.6390 2971.4484 2977.0027 3010.2810 3032.6761 3041.6715 3050.2805 3091.0329 3095.4808 3117.0613 3125.2590 3133.6542 3147.0369 3163.8816 3543.7175
redmass: 7.9679 5.0327 1.7265 1.8020 2.9260 3.0013 3.5586 6.2414 1.0944 4.8964 3.8329 3.4909 3.7352 2.9995 6.7517 7.6600 2.9428 3.7957 4.4196 2.9541 4.6548 4.2757 3.8605 4.3138 10.8927 5.2300 4.1632 4.8615 2.5454 1.4356 1.7696 3.1580 3.7089 5.1929 1.4795 2.8957 2.8115 1.4171 2.2908 1.2984 2.3128 2.0589 3.1609 1.5385 2.7571 1.3025 1.7632 1.4707 1.2562 1.4161 3.7568 2.1207 1.6280 1.7073 1.6320 2.6664 1.9622 1.7574 1.9653 3.2315 1.9508 2.7206 2.7724 1.3479 1.0979 1.0920 1.5231 2.6555 1.0749 1.6777 1.1678 6.6275 6.8877 7.3082 7.7639 12.6881 1.0395 1.0369 1.0820 1.0618 1.0983 1.1018 1.1020 1.0946 1.0965 1.0847 1.0888 1.0950 1.1001 1.0789
irintensity: 0.1091 0.6160 0.9157 0.3384 0.6527 2.1082 2.4954 9.7316 0.2095 2.9347 1.3254 1.8941 0.2761 0.4335 6.1549 17.4511 4.4893 3.1676 0.6565 2.0300 7.0157 6.9737 0.5671 1.0183 5.5764 24.0082 7.7916 4.1452 17.9184 84.3498 81.9469 28.6794 22.1657 2.9507 0.8162 0.7277 25.1696 0.7943 11.3031 0.1200 4.2449 7.8298 9.7751 1.7610 8.8322 0.6659 8.6494 18.8083 7.1367 11.1527 179.7219 3.9969 59.9159 19.3383 14.1726 58.2386 26.6778 16.5961 6.8884 45.6570 12.0628 23.2110 36.0471 10.2218 12.4737 22.4542 23.1301 9.3313 3.8070 39.4336 11.8823 16.1733 10.3085 12.0685 611.6464 74.4285 43.1229 77.5140 12.6896 8.5699 14.1890 26.3259 5.0249 21.1972 9.7086 2.0487 5.4928 37.3316 26.2435 45.8204
temp: 298.150 k
press: 1.00000 atm
elementType: 8 8 7 7 6 6 6 6 6 6 6 6 6 6 6 6 6 6 1 1 1 1 1 1 1 1 1 1 1 1 1 1
symmnumber: 1
zpe: 663866.0 jmol-1
zpe.correction: 0.252853 hartree
zpe.thermalcorrener: 0.268933 hartree
zpe.thermalcorrenthalpy: 0.269878 hartree
zpe.thermalcorrgfe: 0.208128 hartree
zpe.sumelectzpe: -800.600549 hartree
zpe.sumelectthermal: -800.584469 hartree
zpe.sumelectthermalent: -800.583524 hartree
zpe.sumelectthermalfe: -800.645274 hartree
dipole: -4.0584 -2.9991 -1.4428
dipole: 5.2486
quadrupole: -100.1322 -96.0870 -115.4023
quadrupole: 0.6315 5.6471 8.7694
quadrupole: 3.7416 7.7868 -11.5284 0.6315 5.6471 8.7694
hfenergy: -800.853402 hartree
pointgroup: C01 [X(C14H14N2O2)]
dipole: 1.5778957 -1.2087043 0.5597019 debye
polarizability: 196.9899883|-9.0881606|194.5237229|-6.4553093|-0.994529|111.7760942 unknown
InChI: InChI=1S/C14H14N2O2/c1-8-13(10-7-12(17)15-14(10)18)9-5-3-4-6-11(9)16(8)2/h3-6,10,15H,7H2,1-2H3
charge 0 multiplicity 1
32 atoms
O  -1.807189 -1.091345 -2.256872
O  -4.318933 0.985664 1.116427
N  2.377082 -1.000923 0.175598
N  -3.231855 0.057468 -0.764373
C  -1.37682 -1.077786 0.229496
C  0.098505 -0.768179 0.186617
C  1.148796 -1.695256 0.241433
C  0.692173 0.553179 0.0702
C  -2.191113 -0.325134 1.32767
C  2.118742 0.373001 0.072369
C  -2.109096 -0.733156 -1.098429
C  -3.379881 0.326658 0.614184
C  1.107043 -3.193772 0.339431
C  0.169446 1.868964 -0.0462
C  3.020172 1.454911 -0.024135
C  3.720747 -1.580269 0.197923
C  1.06287 2.954244 -0.143547
C  2.473142 2.750804 -0.129817
H  -1.506767 -2.169491 0.355273
H  -1.591762 0.460347 1.818241
H  -2.565161 -0.99057 2.123732
H  -3.895148 0.397278 -1.465804
H  0.064318 -3.546886 0.382319
H  1.574436 -3.677982 -0.53938
H  1.621969 -3.569661 1.244549
H  -0.911198 2.049863 -0.072486
H  4.105012 1.303878 -0.02161
H  4.298363 -1.205693 1.063771
H  3.656632 -2.675975 0.273817
H  4.272746 -1.329793 -0.727206
H  0.670159 3.972828 -0.235242
H  3.142569 3.614683 -0.207248
