program: Gaussian 09
title: 000254399
version: EM64L-G09RevD.01
frameworkgroup: C1[X(C17H13N3O2)]
method: RPBEPBE
basis: SDD
operation: Freq
keyword: #p
keyword: freq=noraman
keyword: PBEPBE/SDD
title: #p freq=noraman PBEPBE/SDD
converged: NO YES NO NO
title: Mulliken charges:
elementType: O O N N N C C C C C C C C C C C C C C C C C H H H H H H H H H H H H H
charge: -0.320725 -0.256171 0.016902 -0.414224 -0.630853 0.228396 -0.117034 0.343928 -0.058000 0.351329 0.176465 -0.365464 -0.389118 -0.368761 -0.376892 0.132193 -0.219470 -0.219573 -0.233953 -0.235070 -0.239402 -0.239120 0.242784 0.243947 0.260461 0.251456 0.357576 0.226767 0.227580 0.231048 0.229670 0.228331 0.231194 0.326508 0.377293
chargesum: 0.00000
title: Mulliken charges with hydrogens summed into heavy atoms:
elementType: O O N N N C C C C C C C C C C C C C C C C C
charge: -0.320725 -0.256171 0.016902 -0.056648 0.072949 0.228396 -0.117034 0.343928 -0.058000 0.351329 0.176465 -0.122681 -0.145171 -0.108300 -0.125436 0.132193 0.007297 0.008007 -0.002904 -0.005399 -0.011071 -0.007926
polarizability: 2.84134456e+02 -2.25263072e+01 2.34567968e+02 -1.68309515e+01 -1.43797556e+01 1.30329359e+02
1716.lowfreq: -5.9844 -0.0004 -0.0002 0.0005 3.3701 6.5943 33.4855 43.0535 44.2995
frequency: 33.4271 43.0181 44.2604 67.7761 73.9118 82.9714 105.0661 126.0203 185.8792 217.1256 229.4888 253.4199 284.8740 314.2364 336.7729 372.4935 396.4299 399.6403 403.1182 426.9783 499.2509 507.6098 522.1928 563.3012 600.8208 605.4411 610.9674 613.3222 619.1040 657.7340 659.7783 697.2014 700.3785 723.2380 727.8035 757.1482 767.5173 769.6624 796.4671 802.6590 822.9943 848.6900 850.6808 907.9000 920.5839 926.2043 973.9366 976.5475 987.9185 989.5801 994.9106 997.1584 1019.5801 1026.5836 1060.9156 1076.9315 1084.3943 1086.8633 1119.8821 1171.8807 1173.9017 1175.0743 1192.2711 1195.2089 1233.6415 1282.2348 1314.9603 1319.5603 1331.0281 1357.1881 1372.8297 1377.5750 1394.0032 1431.0039 1432.3111 1454.0894 1480.6902 1487.2274 1519.3571 1546.5350 1583.8346 1585.7034 1609.0719 1611.3175 1616.7107 1632.4387 3124.8107 3128.8293 3130.9463 3139.5945 3142.0407 3152.5318 3152.9017 3163.3276 3167.1423 3173.2728 3325.9816 3512.7693 3611.1694
redmass: 6.2283 5.7801 4.1870 4.8265 4.4858 6.4265 6.7200 5.5520 5.5643 5.7189 7.8537 5.0119 5.6305 6.1811 5.4326 6.8534 7.0419 2.8434 2.8730 7.1871 3.9288 4.9076 3.8636 5.0295 5.3437 3.0070 3.9018 4.7110 4.1351 4.7349 2.8491 1.9947 1.7065 5.2860 4.4254 2.1306 1.3749 1.5624 1.4638 6.2350 5.3706 1.2483 1.2489 7.5594 1.4100 1.4193 1.4024 1.4035 5.4508 5.8772 1.3391 1.3216 3.4272 2.3239 2.8528 2.6987 1.6474 1.7843 2.7303 2.8089 1.0526 1.1948 1.1164 1.1175 6.3007 4.5548 1.4090 1.4203 3.0211 4.4805 6.6013 7.3064 2.9793 2.1503 2.3110 3.5571 2.3496 2.4682 5.0039 2.3187 5.9657 6.0562 5.3784 5.9571 2.3830 3.9369 1.0851 1.0850 1.0875 1.0886 1.0924 1.0967 1.0935 1.0965 1.1017 1.0998 1.0605 1.0786 1.0917
irintensity: 0.1953 1.7779 0.3776 0.7041 0.6237 1.4249 4.1905 0.4850 2.2600 2.6991 5.0594 0.5030 1.5258 4.9456 11.6586 11.2341 4.3011 1.5163 0.4193 1.7512 0.7211 15.4020 17.3831 27.9931 10.7020 30.6062 6.7179 9.9703 9.5841 21.3093 64.7242 17.6847 77.1792 14.3296 21.8771 50.9062 111.8519 13.9036 131.3674 37.7892 1.7507 0.5052 1.2692 12.3004 1.8543 2.7021 0.0565 0.6655 1.8791 1.3191 0.0399 0.0693 8.4554 6.1531 3.7522 24.7022 13.8323 14.2643 2.3332 29.6732 0.0181 6.6220 1.3818 3.6069 25.5368 0.3760 2.6463 1.4318 50.3708 41.0089 0.3841 5.1206 98.7384 16.2032 15.9297 18.9434 10.2928 3.3203 58.6942 409.2273 3.9741 2.4585 9.9029 2.7254 178.9287 353.6876 1.3101 0.2398 0.2208 7.4687 13.9253 30.9151 23.6278 24.1572 22.6057 10.9156 133.6515 74.7203 79.4014
temp: 298.150 k
press: 1.00000 atm
elementType: 8 8 7 7 7 6 6 6 6 6 6 6 6 6 6 6 6 6 6 6 6 6 1 1 1 1 1 1 1 1 1 1 1 1 1
symmnumber: 1
zpe: 694299.0 jmol-1
zpe.correction: 0.264445 hartree
zpe.thermalcorrener: 0.282237 hartree
zpe.thermalcorrenthalpy: 0.283181 hartree
zpe.thermalcorrgfe: 0.217477 hartree
zpe.sumelectzpe: -968.808478 hartree
zpe.sumelectthermal: -968.790686 hartree
zpe.sumelectthermalent: -968.789742 hartree
zpe.sumelectthermalfe: -968.855446 hartree
dipole: -2.6508 -0.4449 -0.8393
dipole: 2.8159
quadrupole: -118.4716 -120.9953 -123.8707
quadrupole: -2.6644 -5.6462 -8.5221
quadrupole: 2.6409 0.1172 -2.7581 -2.6644 -5.6462 -8.5221
hfenergy: -969.0729226 hartree
pointgroup: C01 [X(C17H13N3O2)]
dipole: 1.0199295 -0.3099214 0.3017007 debye
polarizability: 287.7029365|20.3969704|222.17295|-8.3615135|33.6539938|139.1558962 unknown
InChI: InChI=1S/C17H13N3O2/c18-16(21)14-13(11-7-3-1-4-8-11)15(19-20-17(14)22)12-9-5-2-6-10-12/h1-10,20H,18H2
charge 0 multiplicity 1
35 atoms
O  -3.771733 -2.0605 -0.343759
O  -2.678661 2.041478 -0.697036
N  -0.198368 -2.457443 -0.578605
N  -1.550116 -2.627499 -0.603951
N  -4.347429 0.537766 -0.094548
C  -0.658384 -0.065574 -0.203936
C  0.254259 -1.204783 -0.34661
C  -0.086638 1.298764 0.024694
C  -2.045458 -0.286921 -0.27781
C  1.745836 -1.121543 -0.271536
C  -2.555057 -1.664441 -0.395153
C  0.769295 1.896749 -0.933547
C  -0.358435 1.984345 1.236567
C  2.415421 -0.386018 0.742062
C  2.519118 -1.86729 -1.201647
C  -3.037378 0.86938 -0.366014
C  1.326971 3.169556 -0.693355
C  0.215946 3.247759 1.484057
C  3.824777 -0.391265 0.814141
C  3.927839 -1.864581 -1.132724
C  1.058254 3.847206 0.518371
C  4.587474 -1.123931 -0.124163
H  0.983258 1.37476 -1.872336
H  -1.024536 1.529838 1.978755
H  1.842404 0.182188 1.480047
H  2.004358 -2.449487 -1.972717
H  -1.86235 -3.594223 -0.741479
H  1.972479 3.630167 -1.4490
H  -0.000905 3.768028 2.42353
H  4.325731 0.177712 1.604854
H  4.509115 -2.438175 -1.862998
H  1.497073 4.833264 0.707354
H  5.681772 -1.119253 -0.069284
H  -5.046073 1.274898 -0.189386
H  -4.60976 -0.456931 -0.005439
