program: Gaussian 09
title: 000254367
version: EM64L-G09RevD.01
frameworkgroup: C1[X(C14H11ClN2O)]
method: RPBEPBE
basis: SDD
operation: Freq
keyword: #p
keyword: freq=noraman
keyword: PBEPBE/SDD
title: #p freq=noraman PBEPBE/SDD
converged: YES YES NO NO
title: Mulliken charges:
elementType: Cl O N N C C C C C C C C C C C C C C H H H H H H H H H H H
charge: -0.070934 -0.465465 -0.432544 -0.041398 -0.295073 0.105864 0.307817 -0.014126 0.380177 -0.361009 -0.333420 -0.365909 -0.346675 -0.072330 -0.218804 -0.239277 -0.238799 -0.232919 0.257686 0.341552 0.264615 0.255682 0.244146 0.265302 0.254439 0.356130 0.231396 0.230995 0.232879
chargesum: 0.00000
title: Mulliken charges with hydrogens summed into heavy atoms:
elementType: Cl O N N C C C C C C C C C C C C C C
charge: -0.070934 -0.109335 -0.090992 -0.041398 -0.037386 0.105864 0.307817 -0.014126 0.380177 -0.096394 -0.077738 -0.121763 -0.081373 -0.072330 0.035635 -0.007881 -0.007804 -0.000040
polarizability: 2.80446894e+02 -1.88868091e+00 1.53708035e+02 1.26938841e+01 -1.08136269e+00 9.77092880e+01
1716.lowfreq: -6.6511 -1.3767 -0.0006 0.0006 0.0010 4.9186 14.4390 19.3575 53.5648
frequency: 14.2322 19.2691 53.5534 86.5751 128.6619 142.9460 190.5575 233.9122 248.0220 260.8930 286.0153 302.2217 343.1707 353.6944 400.8969 407.2591 428.4979 481.6754 539.2021 591.3970 594.0068 597.2280 615.5402 654.4962 680.8448 700.4375 727.3897 757.4005 761.2006 776.1862 806.0347 819.9213 846.2034 853.3977 854.5425 891.2629 919.6120 930.7699 951.3010 978.6418 986.6517 993.5551 1000.2865 1028.6967 1046.8588 1085.9440 1117.1321 1167.8483 1175.4827 1184.6278 1193.5156 1207.0618 1211.3368 1255.8282 1260.5645 1298.7921 1315.8374 1339.0857 1366.3858 1383.8351 1386.0774 1439.1448 1443.4039 1459.4815 1484.6410 1513.4895 1584.7659 1593.2822 1613.5151 1629.1326 3009.5583 3123.0934 3132.3181 3145.7236 3159.9452 3160.5579 3170.5967 3170.9773 3180.3237 3555.7746 3577.6752
redmass: 4.3903 5.9089 5.5330 6.6638 6.8088 6.8525 6.6790 3.7426 2.0276 4.4775 2.8640 4.4695 7.5413 7.3397 2.8033 5.6665 3.0333 4.4826 4.4333 6.6394 4.4625 4.6688 6.2928 6.3465 7.9845 1.8410 1.1324 2.1323 2.8272 5.7550 3.3805 1.5987 5.0090 1.2812 1.4923 5.1890 2.9752 1.9353 1.3428 1.5080 4.7049 6.0112 1.3281 2.2138 2.0428 1.6105 1.5185 1.4609 1.0556 1.6385 1.1144 1.7170 2.3058 1.5501 4.2031 1.5791 1.3294 1.3764 3.2757 4.3154 7.0017 2.8879 2.6907 4.5952 2.2894 6.1457 8.4193 6.0895 5.9767 8.1687 1.0838 1.0869 1.0877 1.0928 1.0962 1.0886 1.0939 1.0998 1.0976 1.0666 1.0811
irintensity: 1.4114 0.7634 3.1342 0.2721 0.6663 2.5435 12.9910 6.2049 110.0995 2.2519 37.2066 1.3046 1.7612 2.0440 0.1769 11.3977 10.8945 10.3138 12.2704 7.1125 9.6173 11.2512 1.3985 5.3152 15.9662 50.6763 90.5640 75.9015 4.0921 1.2122 2.6922 56.3651 1.6689 3.0373 29.9848 41.2245 41.0775 20.8141 0.5614 0.0740 8.7109 4.8248 0.1428 8.4037 26.0839 7.6279 1.8804 61.4212 0.8129 15.9629 9.8504 30.8102 3.8017 23.4666 11.7279 89.4960 103.6942 33.2523 9.5710 6.5163 2.2948 73.6961 5.0726 4.7213 11.9446 13.7080 18.6649 2.2855 1.0992 32.9394 12.1837 3.3798 1.2948 21.4711 29.6107 0.8900 1.1486 12.4207 4.5418 15.3911 97.8004
temp: 298.150 k
press: 1.00000 atm
elementType: 17 8 7 7 6 6 6 6 6 6 6 6 6 6 6 6 6 6 1 1 1 1 1 1 1 1 1 1 1
symmnumber: 1
zpe: 570510.3 jmol-1
zpe.correction: 0.217296 hartree
zpe.thermalcorrener: 0.232235 hartree
zpe.thermalcorrenthalpy: 0.233179 hartree
zpe.thermalcorrgfe: 0.172497 hartree
zpe.sumelectzpe: -1183.632429 hartree
zpe.sumelectthermal: -1183.617490 hartree
zpe.sumelectthermalent: -1183.616546 hartree
zpe.sumelectthermalfe: -1183.677228 hartree
dipole: -3.5021 1.0665 1.5521
dipole: 3.9763
quadrupole: -109.0719 -105.1992 -110.8266
quadrupole: 0.0662 -3.1861 -0.0732
quadrupole: -0.7060 3.1667 -2.4607 0.0662 -3.1861 -0.0732
hfenergy: -1183.8497251 hartree
pointgroup: C01 [X(C14H11Cl1N2O1)]
dipole: 1.4367154 -0.6190373 -0.001537 debye
polarizability: 273.4531474|21.3156995|129.060794|-30.4446621|24.7809243|129.3502758 unknown
InChI: InChI=1S/C14H11ClN2O/c15-10-6-7-11-12(8-10)17-14(16-11)13(18)9-4-2-1-3-5-9/h1-8,13,17-18H
charge 0 multiplicity 1
29 atoms
Cl -6.011654 -0.923038 1.0275
O  1.446965 -1.923421 -1.612669
N  -0.971685 -1.175624 -0.743444
N  -0.421736 0.960231 -0.148813
C  1.353613 -0.447579 -1.359688
C  0.013833 -0.183271 -0.704977
C  -2.128821 -0.645256 -0.167489
C  -1.767313 0.699586 0.202754
C  2.584638 0.054038 -0.616554
C  -3.41219 -1.180471 0.068071
C  -2.719072 1.537496 0.826246
C  3.797591 0.173869 -1.344366
C  2.580993 0.331991 0.772999
C  -4.323389 -0.308956 0.689338
C  -4.008942 1.022989 1.069128
C  4.990361 0.555058 -0.694643
C  3.776306 0.711977 1.423948
C  4.98236 0.822823 0.694998
H  1.336893 -0.015069 -2.377885
H  -0.798893 -2.102531 -1.133801
H  -3.696738 -2.198592 -0.209303
H  -2.456951 2.560438 1.110631
H  3.801657 -0.036486 -2.42097
H  1.642563 0.283511 1.333408
H  -4.773528 1.640753 1.548004
H  2.039674 -2.313092 -0.919664
H  5.919806 0.64752 -1.267017
H  3.763917 0.932081 2.497086
H  5.906043 1.122923 1.202275
