program: Gaussian 09
title: 000254377
version: EM64L-G09RevD.01
frameworkgroup: C1[X(C14H18NO5P)]
method: RPBEPBE
basis: SDD
operation: Freq
keyword: #p
keyword: freq=noraman
keyword: PBEPBE/SDD
title: #p freq=noraman PBEPBE/SDD
converged: YES YES NO NO
title: Mulliken charges:
elementType: P O O O O O N C C C C C C C C C C C C C C H H H H H H H H H H H H H H H H H H
charge: 1.297398 -0.513408 -0.525892 -0.621962 -0.213074 -0.187416 -0.226914 -0.304146 -0.791575 0.190712 0.179980 0.097631 0.087843 -0.352610 -0.350273 -0.245187 -0.254798 -0.209649 -0.209083 -0.658862 -0.650390 0.263870 0.277165 0.303093 0.303755 0.270465 0.272040 0.251910 0.220937 0.223783 0.241261 0.241098 0.241467 0.207332 0.228072 0.231995 0.216029 0.249315 0.218087
chargesum: 0.00000
title: Mulliken charges with hydrogens summed into heavy atoms:
elementType: P O O O O O N C C C C C C C C C C C C C C
charge: 1.297398 -0.513408 -0.525892 -0.621962 -0.213074 -0.187416 -0.226914 0.236889 -0.184727 0.190712 0.179980 0.097631 0.087843 -0.082145 -0.078233 0.227660 0.210246 0.031449 0.032385 0.008537 0.033041
polarizability: 2.69934086e+02 6.17869748e-01 2.05149254e+02 -1.26739534e+01 1.51321964e+01 1.28336262e+02
1716.lowfreq: -4.8234 -0.0011 0.0013 0.0014 3.5411 4.2155 19.3658 27.0122 29.2050
frequency: 18.7167 26.9820 29.1245 36.9699 39.5222 58.4988 75.0211 85.6174 106.9531 129.0101 134.5829 139.6434 161.5831 178.6550 203.4087 224.1881 233.9156 242.7597 250.1304 267.2617 285.6293 320.9293 331.3219 363.6392 374.6027 410.4220 415.7842 450.2812 455.9635 517.0684 523.9286 582.9368 615.8625 659.0803 664.5784 678.6696 697.8950 709.6528 753.5411 780.4203 785.9232 798.6673 804.7792 817.4238 848.1501 860.9008 872.9784 907.4497 951.8276 965.9606 975.3614 1007.6802 1011.4064 1014.6474 1018.1690 1037.3359 1039.0216 1072.2263 1091.5523 1092.4351 1105.4846 1135.4800 1146.4018 1168.4543 1171.2248 1204.0347 1231.0220 1268.0511 1271.3726 1273.0346 1283.8626 1329.7685 1341.0422 1353.4378 1368.2060 1383.7991 1391.1293 1392.6226 1417.3027 1429.0275 1452.3974 1454.7163 1456.9692 1461.4825 1465.4950 1466.1386 1477.5927 1482.8497 1495.4270 1614.5922 1617.3563 1626.4608 1676.7674 2979.4726 2985.4099 2993.1519 3008.2698 3023.7519 3043.1623 3044.8700 3077.4946 3082.2014 3089.8735 3090.4138 3105.6553 3107.3784 3117.1431 3141.3825 3154.3652 3165.6620 3175.7656
redmass: 4.7958 3.4218 4.3111 3.6121 3.0661 4.3572 4.1142 2.6135 3.5994 6.1318 4.6012 5.0980 3.0594 5.9031 2.7587 1.9393 4.1680 1.7683 1.5275 3.0131 3.7557 5.3684 9.6910 5.3436 4.4032 4.0268 3.7915 4.1953 4.8480 7.1824 7.3067 9.0714 6.4737 4.8063 6.6006 5.6510 6.3483 3.2461 3.0187 1.6470 4.0218 1.8113 1.1244 1.0987 4.3782 3.4137 4.1006 1.3931 6.9594 2.4638 1.4135 1.3495 2.6932 2.3181 2.7876 3.6031 4.3419 2.6845 2.3044 2.1384 2.3123 1.4388 1.5670 1.2117 1.9962 2.8578 1.5485 1.1345 1.2541 1.1218 1.4930 1.4964 2.7260 1.2225 1.2369 1.4336 1.2283 1.2478 6.0075 1.0797 2.5121 2.4604 1.0405 1.0438 1.0732 1.1396 1.0502 1.0526 1.0842 7.6670 8.2884 10.9147 11.8321 1.0557 1.0357 1.0366 1.0617 1.0611 1.0604 1.1052 1.1025 1.0977 1.1033 1.0983 1.1045 1.1020 1.1055 1.0865 1.0906 1.0957 1.1005
irintensity: 0.1917 0.5808 0.2686 1.3582 0.2302 0.1342 3.0806 1.6903 5.6677 0.9716 1.2558 0.0207 26.7354 0.0740 0.4738 0.4928 1.1155 3.2567 2.3606 5.9328 23.3522 7.1042 26.3405 0.0497 15.2410 6.1060 8.2699 49.5083 0.0874 1.8165 8.9200 25.1445 19.4286 0.1199 104.6127 4.0372 15.9538 64.8999 77.1968 10.1432 2.6359 22.2388 5.3310 2.6434 11.4202 172.7250 128.0123 0.0100 31.3648 32.6773 2.0673 0.0050 117.0653 45.7392 98.0577 21.4132 22.8892 21.6263 86.3774 10.9646 36.8896 5.7828 10.0338 9.4717 6.3215 19.0163 0.4231 3.3849 9.8580 0.6918 0.9794 115.8432 254.4406 4.3145 2.1334 45.9555 21.9557 25.3650 10.3451 8.6127 2.5096 12.2301 10.7527 12.3129 5.4405 35.3463 5.2918 16.4478 3.3602 2.6843 139.1978 320.8697 63.6942 16.5614 16.3889 25.2417 34.0292 5.0787 6.0973 7.0995 3.5702 42.7736 0.4903 25.1977 34.2141 34.2447 0.8982 1.5307 4.5213 5.0103 20.6411
temp: 298.150 k
press: 1.00000 atm
elementType: 15 8 8 8 8 8 7 6 6 6 6 6 6 6 6 6 6 6 6 6 6 1 1 1 1 1 1 1 1 1 1 1 1 1 1 1 1 1 1
symmnumber: 1
zpe: 795559.0 jmol-1
zpe.correction: 0.303012 hartree
zpe.thermalcorrener: 0.325395 hartree
zpe.thermalcorrenthalpy: 0.326340 hartree
zpe.thermalcorrgfe: 0.248111 hartree
zpe.sumelectzpe: -1314.834832 hartree
zpe.sumelectthermal: -1314.812449 hartree
zpe.sumelectthermalent: -1314.811505 hartree
zpe.sumelectthermalfe: -1314.889734 hartree
dipole: -4.2383 3.5596 3.6160
dipole: 6.6113
quadrupole: -97.6623 -139.1927 -135.8450
quadrupole: 2.6918 6.1285 -6.0988
quadrupole: 26.5710 -14.9594 -11.6117 2.6918 6.1285 -6.0988
hfenergy: -1315.1378447 hartree
pointgroup: C01 [X(C14H18N1O5P1)]
dipole: -1.7573356 -0.6167666 -1.8157511 debye
polarizability: 270.8849209|4.1301029|171.5046973|-0.6916703|41.4884457|161.0299843 unknown
InChI: InChI=1S/C14H18NO5P/c1-3-19-21(18,20-4-2)10-9-15-13(16)11-7-5-6-8-12(11)14(15)17/h5-8H,3-4,9-10H2,1-2H3
charge 0 multiplicity 1
39 atoms
P  2.89205 0.891425 0.327581
O  3.220531 -0.819007 0.230338
O  3.465871 1.589929 -1.163427
O  3.504667 1.510538 1.657069
O  -0.822169 -1.568274 -0.954355
O  -2.121983 1.669826 2.206506
N  -1.145513 0.083758 0.721973
C  0.260941 0.236762 1.112977
C  1.049596 1.044853 0.056051
C  -3.07079 -0.664577 -0.352522
C  -3.460575 0.312982 0.596686
C  -1.583165 -0.820125 -0.28695
C  -2.234095 0.810936 1.299985
C  -4.013171 -1.313569 -1.163767
C  -4.805301 0.673419 0.765865
C  2.875166 -1.579384 -1.0128
C  4.848796 2.1557 -1.17598
C  -5.377281 -0.955939 -1.000097
C  -5.767238 0.022155 -0.050532
C  3.531911 -2.94923 -0.865691
C  5.906616 1.066831 -1.381869
H  0.700202 -0.770542 1.229245
H  0.281254 0.746401 2.091043
H  0.799301 2.117798 0.09434
H  0.849377 0.66686 -0.959965
H  -3.701783 -2.067684 -1.89323
H  -5.09473 1.429031 1.502753
H  1.773667 -1.667384 -1.092415
H  3.263963 -1.030349 -1.891778
H  4.823871 2.869252 -2.015977
H  5.01568 2.70491 -0.229925
H  -6.141805 -1.44193 -1.615448
H  -6.827153 0.27728 0.053422
H  3.300256 -3.574427 -1.748172
H  4.627235 -2.849703 -0.77832
H  3.156146 -3.463503 0.035007
H  6.908208 1.529804 -1.462743
H  5.921735 0.363393 -0.530934
H  5.712111 0.499381 -2.308844
