program: Gaussian 09
title: 000254365
version: EM64L-G09RevD.01
frameworkgroup: C1[X(C16H11N3O)]
method: RPBEPBE
basis: SDD
operation: Freq
keyword: #p
keyword: freq=noraman
keyword: PBEPBE/SDD
title: #p freq=noraman PBEPBE/SDD
converged: NO YES NO NO
title: Mulliken charges:
elementType: O N N N C C C C C C C C C C C C C C C C H H H H H H H H H H H
charge: -0.240130 -0.281624 0.047357 0.010384 0.196147 0.265118 -0.158183 0.009130 -0.385245 -0.316385 0.060870 0.115873 0.202207 -0.242567 -0.210134 -0.337411 -0.347952 -0.748460 -0.225174 -0.219795 0.267211 0.312205 0.232897 0.231397 0.265454 0.259895 0.258361 0.248685 0.257942 0.236229 0.235695
chargesum: 0.00000
title: Mulliken charges with hydrogens summed into heavy atoms:
elementType: O N N N C C C C C C C C C C C C C C C C
charge: -0.240130 -0.281624 0.047357 0.010384 0.196147 0.265118 -0.158183 0.009130 -0.118034 -0.004179 0.060870 0.115873 0.202207 -0.009670 0.021263 -0.071957 -0.088057 0.016529 0.011055 0.015900
polarizability: 3.66690845e+02 -9.41064632e+00 2.15858042e+02 1.62594398e-03 1.04127808e-02 7.65925845e+01
1716.lowfreq: -3.7673 -0.0007 -0.0004 0.0005 5.2787 6.4099 52.1388 66.6792 75.8209
frequency: 52.1298 66.6609 75.8202 116.6876 144.5816 161.2668 175.5483 201.0745 234.9326 313.1651 331.1132 335.2180 362.8501 364.3478 411.3381 427.2922 467.3352 488.5205 539.4890 545.1984 552.6893 565.0855 585.6109 595.1153 604.4455 620.1412 678.9015 705.4974 734.0309 760.9006 769.2727 774.7312 781.7623 818.0649 862.2606 885.4448 896.0806 908.0525 930.1071 969.7265 971.1750 996.7099 1000.7220 1006.6076 1009.6371 1013.6882 1038.0488 1047.4122 1103.9210 1116.1821 1156.1945 1164.7608 1181.7519 1202.6126 1223.6161 1240.9203 1261.7560 1284.9165 1317.0632 1338.6183 1388.1057 1390.5235 1394.3724 1404.7620 1428.8034 1445.2467 1447.7332 1458.2574 1474.3760 1505.3746 1550.6730 1553.1844 1591.2124 1611.7968 1619.1116 1633.1172 3011.7798 3099.1052 3136.5047 3137.4961 3138.7546 3149.5287 3154.0553 3163.1861 3171.3769 3173.7840 3216.1956
redmass: 3.7370 5.8100 5.2871 4.3471 5.1228 1.0381 5.7656 5.3372 5.8450 4.3295 4.7648 8.4076 4.1005 5.6930 6.6752 4.5753 4.9633 3.3818 7.0723 3.3536 6.5009 3.6620 6.0651 6.7228 3.5996 8.1153 6.1745 7.2744 4.1011 5.9115 1.9018 1.3785 2.1182 4.0932 6.5360 1.6679 1.4173 5.0184 7.7678 1.3605 1.3833 1.3269 1.3158 2.2529 3.1066 2.1021 1.6956 2.7971 1.8872 1.6791 1.3068 1.2290 2.6790 2.6181 2.2299 2.4354 3.1074 2.8218 2.3909 2.8642 1.3698 3.8675 6.7446 3.5984 1.1078 2.5762 1.0457 2.8926 3.2778 5.1552 7.7986 10.6882 7.2343 7.1898 8.0096 7.9941 1.0360 1.0959 1.0859 1.0867 1.1029 1.0894 1.0920 1.0957 1.0990 1.1006 1.0949
irintensity: 1.8959 3.3951 3.2743 0.3089 0.0402 0.0937 0.5713 5.0428 0.3201 9.1416 0.0392 0.6227 4.2278 0.4226 1.0538 0.3943 18.0984 7.6098 3.4932 0.0353 2.1387 0.3108 25.6966 13.5312 0.5855 1.1911 5.4210 1.0355 2.4492 7.4245 79.0798 30.6835 73.7989 6.7416 0.1178 0.0006 0.8126 7.8491 0.4178 1.3251 6.9034 0.0003 1.2472 35.9039 4.1027 21.7002 7.5781 7.6167 13.1931 7.1822 18.9670 1.3869 59.8249 72.9944 22.6786 21.1112 21.4746 253.4154 56.9729 290.4022 27.5080 54.6226 30.0329 28.2132 49.7257 70.9490 19.1712 32.9684 19.8297 7.5092 10.3497 4.5110 11.6439 35.8105 141.9280 85.9500 1.8225 4.1727 1.5168 3.3996 17.6252 5.6392 15.8715 13.6224 23.4115 30.5871 4.2436
temp: 298.150 k
press: 1.00000 atm
elementType: 8 7 7 7 6 6 6 6 6 6 6 6 6 6 6 6 6 6 6 6 1 1 1 1 1 1 1 1 1 1 1
symmnumber: 1
zpe: 609720.0 jmol-1
zpe.correction: 0.232230 hartree
zpe.thermalcorrener: 0.247074 hartree
zpe.thermalcorrenthalpy: 0.248018 hartree
zpe.thermalcorrgfe: 0.190291 hartree
zpe.sumelectzpe: -854.466766 hartree
zpe.sumelectthermal: -854.451922 hartree
zpe.sumelectthermalent: -854.450978 hartree
zpe.sumelectthermalfe: -854.508705 hartree
dipole: -2.4025 -0.8297 0.0114
dipole: 2.5418
quadrupole: -99.8632 -109.6765 -118.9361
quadrupole: -10.9790 0.0315 0.0202
quadrupole: 9.6287 -0.1845 -9.4442 -10.9790 0.0315 0.0202
hfenergy: -854.6989962 hartree
pointgroup: C01 [X(C16H11N3O1)]
dipole: -0.9416356 0.3358568 0.0233819 debye
polarizability: 366.8614979|7.8909762|215.1373368|-1.6423727|8.6042584|77.1426374 unknown
InChI: InChI=1S/C16H11N3O/c1-10(20)19-14-9-5-2-6-11(14)15-16(19)18-13-8-4-3-7-12(13)17-15/h2-9H,1H3
charge 0 multiplicity 1
31 atoms
O  2.957751 -2.72638 -0.259547
N  1.303145 -1.092319 -0.148479
N  -1.059577 1.646564 0.040269
N  -1.16421 -1.273188 -0.143348
C  1.443792 1.246554 -0.00391
C  2.205399 0.037204 -0.084669
C  0.039118 0.87712 -0.016366
C  -0.025859 -0.579693 -0.107524
C  2.082171 2.502364 0.068095
C  3.61499 0.066734 -0.094031
C  -2.270394 0.956297 0.005589
C  -2.323679 -0.496519 -0.086277
C  1.726613 -2.458353 -0.235948
C  3.49177 2.540043 0.058807
C  4.239337 1.335027 -0.021285
C  -3.490416 1.696785 0.061522
C  -3.592679 -1.148111 -0.118773
C  0.658598 -3.529983 -0.300538
C  -4.719955 1.03231 0.028165
C  -4.770668 -0.395479 -0.062541
H  1.482536 3.415643 0.128889
H  4.194674 -0.853493 -0.155087
H  4.015172 3.50021 0.11351
H  5.334047 1.381747 -0.027362
H  -3.420741 2.786721 0.130093
H  -3.608034 -2.240226 -0.18795
H  -0.000079 -3.496468 0.583334
H  1.171077 -4.50135 -0.362641
H  -0.003203 -3.386492 -1.171006
H  -5.652946 1.604226 0.071335
H  -5.742352 -0.900395 -0.087826
