program: Gaussian 09
title: 000254359
version: EM64L-G09RevD.01
frameworkgroup: C1[X(C14H7Cl2N3)]
method: RPBEPBE
basis: SDD
operation: Freq
keyword: #p
keyword: freq=noraman
keyword: PBEPBE/SDD
title: #p freq=noraman PBEPBE/SDD
converged: NO NO NO NO
title: Mulliken charges:
elementType: Cl Cl N N N C C C C C C C C C C C C C C H H H H H H H
charge: 0.010211 -0.035495 -0.444803 0.061106 0.019830 0.350325 -0.117353 0.313859 -0.052596 -0.313754 0.072098 0.105551 -0.373663 -0.273058 -0.069099 -0.339329 -0.346089 -0.224706 -0.221704 0.330639 0.270766 0.278882 0.267137 0.261884 0.235000 0.234364
chargesum: 0.00000
title: Mulliken charges with hydrogens summed into heavy atoms:
elementType: Cl Cl N N N C C C C C C C C C C C C C C
charge: 0.010211 -0.035495 -0.114165 0.061106 0.019830 0.350325 -0.117353 0.313859 -0.052596 -0.313754 0.072098 0.105551 -0.102897 0.005824 -0.069099 -0.072193 -0.084205 0.010294 0.012660
polarizability: 4.03477804e+02 -1.24767035e+01 1.92135312e+02 3.37171240e-03 -1.38113794e-02 6.84402433e+01
1716.lowfreq: -3.8440 -3.8250 -0.0014 0.0011 0.0018 10.0893 42.5226 73.7555 102.1991
frequency: 42.5126 73.7115 102.1991 124.7751 156.7056 169.1413 219.7413 236.7279 240.2935 283.7758 343.5384 367.1451 383.5419 410.9444 449.5439 453.7083 487.2155 511.6756 533.8011 565.0011 565.7189 587.4211 587.6995 591.1386 615.1315 679.3546 724.0317 745.8292 764.5822 768.3359 778.1431 809.3948 830.9353 849.9132 855.0353 885.1198 886.7836 941.9310 970.1120 996.9221 1004.5201 1011.1031 1080.9210 1115.6734 1151.7503 1155.5848 1208.5328 1226.0897 1234.3313 1247.6678 1281.2764 1327.3608 1341.4245 1371.3215 1393.3395 1408.2965 1430.2586 1458.8515 1465.4568 1507.4537 1545.0737 1568.5398 1579.7670 1616.8994 1632.5037 3134.0981 3148.0604 3162.8405 3166.3761 3172.3634 3177.5965 3585.7535
redmass: 9.9984 5.9413 10.9353 7.5079 6.2986 19.7927 5.9039 10.1665 5.2574 9.1744 5.7724 5.8472 12.9499 5.8888 7.7895 8.7170 3.4473 6.9715 3.9280 2.4450 1.6507 3.4872 6.9039 7.4916 6.6921 9.1189 5.0685 6.8004 8.9598 3.8015 1.3878 5.4178 7.1373 1.4161 1.4725 1.6624 6.5547 7.4266 1.3570 1.3248 5.2777 2.2379 1.8255 1.6716 3.1464 1.2288 2.5482 1.8912 2.2353 3.2833 2.0351 2.8585 3.1798 5.2072 4.7092 3.7952 5.2553 3.3570 3.6939 5.1247 7.9547 9.5395 7.1782 7.4203 8.4452 1.0860 1.0895 1.0957 1.0937 1.1004 1.0930 1.0806
irintensity: 0.1083 0.1973 0.3249 3.0226 1.5117 0.2515 0.5480 2.1410 0.1263 2.8368 2.2152 0.2176 7.4196 0.8560 1.0396 8.9124 3.2109 0.0428 1.4731 23.7068 50.4003 58.3001 1.5628 17.9337 1.2724 2.6502 0.0064 15.5674 37.3367 2.5313 101.0170 0.1094 11.1739 30.0259 32.7443 0.0344 7.3025 100.5518 3.0489 0.0011 0.1838 12.7659 53.2490 8.5291 18.5845 10.8352 31.6825 5.7303 0.4565 11.3461 75.1323 118.3251 24.5927 33.1568 56.2285 30.6953 37.9429 10.8543 37.6061 5.1645 4.8123 63.4764 118.2562 217.7023 77.0299 2.8624 7.3728 12.7277 0.1411 33.3625 0.8827 69.2956
temp: 298.150 k
press: 1.00000 atm
elementType: 17 17 7 7 7 6 6 6 6 6 6 6 6 6 6 6 6 6 6 1 1 1 1 1 1 1
symmnumber: 1
zpe: 463554.8 jmol-1
zpe.correction: 0.176559 hartree
zpe.thermalcorrener: 0.190599 hartree
zpe.thermalcorrenthalpy: 0.191544 hartree
zpe.thermalcorrgfe: 0.134961 hartree
zpe.sumelectzpe: -1620.817381 hartree
zpe.sumelectthermal: -1620.803340 hartree
zpe.sumelectthermalent: -1620.802396 hartree
zpe.sumelectthermalfe: -1620.858979 hartree
dipole: -1.0954 -2.4498 0.0003
dipole: 2.6836
quadrupole: -111.0120 -113.7039 -126.3439
quadrupole: -4.3186 0.0005 -0.0015
quadrupole: 6.0080 3.3160 -9.3240 -4.3186 0.0005 -0.0015
hfenergy: -1620.9939395 hartree
pointgroup: C01 [X(C14H7Cl2N3)]
dipole: -0.42351 -0.9671387 0.000106 debye
dipolederiv: -0.0826688 0.1562986 -0.0000176 -0.0361589 -0.679148 0.0000739 0.0000035 0.0000771 -0.0259413 -1.0686257 0.1295156 -0.0000137 0.1666705 -0.1492899 0.0000108 -0.0000046 0.0000099 -0.0541973 -1.5365662 -0.1702527 0.0000107 0.0453757 -0.4691701 0.0000217 -0.0000239 0.0000256 -0.3372187 0.1023212 0.0508612 0.0000009 0.0606368 -0.1842999 -0.0000082 0.0000058 -0.0000038 -0.2370737 -0.4445381 0.1658443 -0.0000231 -0.1183715 -0.2659677 -0.0000003 0.0000072 0.0000028 -0.2631218 -0.3122193 0.1953128 -0.000023 -0.4506374 -0.4426499 0.000047 0.000054 0.0000479 -0.0264375 0.5986613 -0.0722226 0.0000066 0.7814985 0.0116161 0.0000194 -0.0000957 0.0000078 0.0985695 0.9222938 0.3695285 -0.000041 0.6965272 0.4564416 -0.0000364 -0.0000718 -0.000039 0.0935197 0.9517094 -0.1960181 0.0000361 -1.2003351 0.1712579 -0.0000097 0.0001501 -0.0000036 0.1969681 0.5629424 -0.3718471 0.0000427 0.338985 1.0861186 -0.0001291 -0.000037 -0.000131 -0.0408338 -0.1940332 -0.0333289 0.000002 -0.4341123 -0.0645422 0.0000125 0.0000413 0.0000161 0.1001119 0.2762447 -0.2575629 0.0000325 0.3356298 0.0104088 0.0000107 -0.0000312 0.0000046 0.084534 -0.7471959 -0.22402 0.0000263 -0.1405049 -0.1480546 -0.0000032 0.0000201 -0.0000018 -0.1716628 -0.6401988 0.3008764 -0.0000345 0.2077738 -0.4303975 0.0000374 -0.0000198 0.000037 -0.1019174 1.5080445 -0.1086163 0.0000057 -0.1948442 0.5395602 -0.0000679 -0.0000013 -0.0000676 -0.0491658 0.1117246 0.0568564 -0.000002 -0.1183017 0.0944479 -0.0000254 0.0000187 -0.0000217 -0.1533351 -0.0837952 0.137792 -0.0000141 0.115885 0.1021516 -0.0000277 -0.00001 -0.0000289 -0.1713405 -0.1771218 -0.1547927 0.0000149 -0.2965239 0.0245955 -0.0000204 0.0000253 -0.0000195 -0.1591818 0.0284606 0.0739476 -0.0000062 0.2533676 0.0696488 -0.0000211 -0.0000273 -0.000022 -0.1422782 0.1105899 -0.0048893 -0.0000018 -0.0026199 0.2421715 0.0000102 -0.0000025 0.0000066 0.3439755 0.0780659 0.0164271 -0.000002 0.0407178 -0.0118317 0.0000228 -0.0000034 0.0000209 0.1910163 0.0519415 -0.0392209 0.0000048 -0.0422607 0.0501718 0.0000152 0.000005 0.0000159 0.1761209 0.0959944 -0.0573681 0.0000046 0.0193268 -0.0355256 0.00002 -0.0000034 0.0000167 0.1625729 0.0783315 0.0015715 -0.0000014 -0.0786793 -0.0520997 0.0000221 0.0000075 0.0000242 0.1638288 -0.0625109 0.1003212 -0.0000117 0.1154622 0.0024209 0.0000174 -0.0000117 0.0000166 0.162604 -0.1278517 -0.0650138 0.0000043 -0.064507 0.0719656 0.0000082 0.000005 0.0000092 0.1598842 unknown
polarizability: 403.6579749|-10.8424097|191.9551407|0.0034783|-0.0137849|68.4402433 unknown
InChI: InChI=1S/C14H7Cl2N3/c15-7-5-8(16)12-11(6-7)19-14-13(12)17-9-3-1-2-4-10(9)18-14/h1-6,19H
charge 0 multiplicity 1
26 atoms
Cl 1.745619 3.093267 -0.000328
Cl 5.943943 -0.50257 0.000078
N  0.834136 -1.936766 0.000255
N  -1.036934 1.125749 -0.000101
N  -1.593084 -1.76182 0.000192
C  1.389147 0.313371 -0.000004
C  -0.064172 0.201052 0.000013
C  1.908672 -1.030964 0.000157
C  -0.369364 -1.234526 0.000154
C  2.311105 1.383579 -0.000128
C  -2.335727 0.619429 -0.000065
C  -2.616781 -0.811928 0.000081
C  3.286888 -1.314993 0.000188
C  3.69885 1.134471 -0.000101
C  4.155707 -0.205152 0.000061
C  -3.425957 1.54459 -0.000184
C  -3.973414 -1.257987 0.000101
C  -4.743789 1.08012 -0.000148
C  -5.017629 -0.327815 -0.000006
H  0.904835 -2.953852 0.000364
H  3.675768 -2.337034 0.0003
H  4.410493 1.964223 -0.000204
H  -3.182353 2.611567 -0.000286
H  -4.155481 -2.337252 0.000213
H  -5.577763 1.79033 -0.000224
H  -6.057813 -0.67219 0.000022
