program: Gaussian 09
title: 000250346
version: EM64L-G09RevD.01
frameworkgroup: C1[X(C19H16N2O2)]
method: RPBEPBE
basis: SDD
operation: Freq
keyword: #p
keyword: freq=noraman
keyword: PBEPBE/SDD
title: #p freq=noraman PBEPBE/SDD
converged: YES YES NO NO
title: Mulliken charges:
elementType: O O N N C C C C C C C C C C C C C C C C C C C H H H H H H H H H H H H H H H H
charge: -0.174686 -0.192941 -0.315006 -0.456218 -0.365869 0.331183 -0.580160 0.114099 0.104521 0.136840 0.142649 0.208648 0.492341 -0.373405 -0.789380 -0.363522 -0.278611 -0.216023 -0.341065 -0.344579 -0.223268 -0.222617 -0.241452 0.245963 0.286804 0.267932 0.303741 0.225139 0.237732 0.251143 0.234278 0.228980 0.222203 0.222510 0.266404 0.266965 0.229373 0.228937 0.230422
chargesum: 0.00000
title: Mulliken charges with hydrogens summed into heavy atoms:
elementType: O O N N C C C C C C C C C C C C C C C C C C C
charge: -0.174686 -0.192941 -0.315006 -0.152477 -0.119906 0.331183 -0.025424 0.114099 0.104521 0.136840 0.142649 0.208648 0.492341 -0.148266 -0.066228 -0.134542 -0.056408 0.006486 -0.074661 -0.077615 0.006105 0.006320 -0.011031
polarizability: 2.69159934e+02 -2.11910172e+01 2.32326130e+02 3.34880258e-01 1.39984910e+01 1.60655478e+02
1716.lowfreq: -12.4105 -2.9432 -0.0009 -0.0003 0.0001 4.9149 14.2424 18.1273 41.6290
frequency: 13.5769 17.6693 41.6090 56.0879 76.8438 79.3984 102.9866 124.5660 138.6281 163.1738 181.1190 220.9648 271.7526 280.1645 292.0575 300.5775 360.4238 385.2414 404.4007 432.0143 440.1748 474.2295 488.6675 508.1288 511.7439 536.6285 560.3274 576.0501 591.4575 602.1397 610.5243 620.1117 654.6267 670.1828 675.8240 691.4999 734.9265 748.0204 749.6221 768.9661 778.1136 836.2113 848.9121 854.1592 894.9395 913.1854 914.8904 929.0584 965.4336 969.6525 970.0066 990.5676 992.3526 1003.5529 1003.9627 1021.7257 1029.5214 1040.0033 1050.8038 1090.3674 1105.1079 1135.2056 1146.8556 1155.1517 1163.9346 1173.8171 1175.4913 1196.5958 1233.3045 1238.7373 1250.0263 1272.3925 1301.0204 1312.0301 1325.1121 1330.0153 1345.6734 1383.8585 1400.8956 1415.0964 1429.8905 1442.6956 1445.1616 1465.0821 1467.2421 1472.5813 1484.2277 1486.3802 1581.2490 1594.4186 1599.1857 1610.2471 1630.4582 1635.6955 1691.7254 2971.9182 3007.2949 3030.2581 3042.3745 3087.0366 3096.0319 3123.7850 3130.2305 3131.2481 3144.5399 3144.6397 3161.7965 3163.5045 3187.0368 3191.1956 3603.0899
redmass: 5.6394 4.7830 4.1244 5.5791 1.0981 6.5686 5.3883 3.2807 3.4324 4.9051 5.4718 3.7843 4.3912 5.6259 4.2766 5.5636 6.1189 5.1484 2.8340 2.9231 5.9989 5.1661 4.4111 1.7466 1.9033 4.4846 2.9850 3.4654 7.2947 4.6288 6.4187 6.0267 5.0015 4.5335 5.7759 1.9311 3.9646 1.3852 4.8476 1.9155 4.5181 1.2537 1.5110 4.1469 3.2280 1.5733 3.9803 1.3911 2.0264 1.3864 1.3269 5.9687 1.3700 4.4146 2.1523 2.0794 2.2175 1.6319 2.6822 1.7378 2.1886 4.1778 1.9116 1.8823 1.7995 1.1957 1.0495 1.1382 1.4108 1.4508 2.0080 1.4135 2.0445 3.0603 5.4588 1.3206 1.8269 9.3101 1.8149 2.2872 2.6696 1.9295 1.1921 1.3669 2.0527 1.2782 2.5377 2.2887 6.5416 6.3828 6.4719 5.9611 10.8173 7.1678 12.6771 1.0392 1.0820 1.0620 1.0983 1.1017 1.0951 1.0851 1.0891 1.0855 1.0908 1.0949 1.0972 1.1000 1.0947 1.0965 1.0804
irintensity: 0.2733 0.6016 0.9218 1.0730 0.0825 5.0860 1.2115 1.8929 2.8210 0.4677 3.8210 0.5699 1.1653 6.2782 1.1301 2.8796 0.5519 2.3681 0.3706 6.7441 4.1907 6.0244 3.3470 31.4353 63.5626 1.6226 1.3825 6.0252 7.2850 14.8208 5.8181 15.4686 4.8981 8.3227 10.2995 44.2584 37.6138 101.0819 6.0322 43.2552 3.4805 0.1165 0.8098 0.4666 3.3533 2.4892 6.0201 1.2538 11.9939 0.0583 0.5292 0.4387 0.6346 2.6206 3.4802 12.4344 4.7955 2.5742 6.6270 6.6937 3.8977 184.9394 24.7522 50.6806 53.8712 3.2901 0.0544 0.3955 7.3061 12.2555 15.8902 15.7999 9.0395 35.4930 277.1022 2.6080 13.2236 0.6739 4.5553 28.0923 32.0518 8.7499 15.8762 12.2665 25.1407 9.9971 2.5180 82.4956 10.1329 13.9053 21.9812 15.4257 389.5096 53.9376 12.2564 52.2429 10.8216 7.8023 16.7659 4.3399 20.5189 5.4845 3.5327 0.0479 17.5356 40.6157 35.0161 26.0895 3.2481 0.8721 56.7363
temp: 298.150 k
press: 1.00000 atm
elementType: 8 8 7 7 6 6 6 6 6 6 6 6 6 6 6 6 6 6 6 6 6 6 6 1 1 1 1 1 1 1 1 1 1 1 1 1 1 1 1
symmnumber: 1
zpe: 798908.5 jmol-1
zpe.correction: 0.304288 hartree
zpe.thermalcorrener: 0.323510 hartree
zpe.thermalcorrenthalpy: 0.324455 hartree
zpe.thermalcorrgfe: 0.254106 hartree
zpe.sumelectzpe: -992.022679 hartree
zpe.sumelectthermal: -992.003457 hartree
zpe.sumelectthermalent: -992.002513 hartree
zpe.sumelectthermalfe: -992.072861 hartree
dipole: 3.6151 -2.2018 -0.5140
dipole: 4.2639
quadrupole: -107.2431 -118.4153 -145.3608
quadrupole: -10.5517 3.6864 -1.8709
quadrupole: 16.4300 5.2578 -21.6877 -10.5517 3.6864 -1.8709
hfenergy: -992.3269676 hartree
pointgroup: C01 [X(C19H16N2O2)]
dipole: 1.3897643 0.8738185 0.3452567 debye
polarizability: 267.5915968|22.2521704|227.8204883|2.886018|24.5948766|166.7294575 unknown
InChI: InChI=1S/C19H16N2O2/c1-12-18(14-9-5-6-10-16(14)20-12)15-11-17(22)21(19(15)23)13-7-3-2-4-8-13/h2-10,15,20H,11H2,1H3
charge 0 multiplicity 1
39 atoms
O  -0.655904 1.117525 1.659571
O  -2.024841 0.249075 -2.765114
N  -1.640771 0.533314 -0.430352
N  4.014479 0.82887 0.750198
C  0.555824 1.551301 -0.481808
C  1.890702 0.992491 -0.055732
C  0.109584 1.204222 -1.926624
C  -0.607663 1.056831 0.412638
C  2.299788 -0.403939 -0.113387
C  2.95852 1.718847 0.484372
C  -1.291875 0.611105 -1.817072
C  3.643658 -0.473137 0.395855
C  -2.8929 0.002578 0.058595
C  1.666169 -1.606466 -0.528548
C  3.101511 3.178582 0.808766
C  4.362123 -1.683898 0.485789
C  2.376234 -2.820045 -0.440647
C  3.711034 -2.859474 0.057533
C  -3.475318 -1.123593 -0.57353
C  -3.531733 0.610168 1.167425
C  -4.699512 -1.635115 -0.093032
C  -4.751229 0.082901 1.642713
C  -5.341428 -1.038306 1.016087
H  0.57759 2.65007 -0.350999
H  0.777451 0.465793 -2.401761
H  0.074802 2.081825 -2.594021
H  4.911913 1.10001 1.146812
H  0.635039 -1.605487 -0.899984
H  2.225702 3.748464 0.459004
H  3.182817 3.345723 1.900247
H  3.99835 3.619821 0.332762
H  5.385372 -1.717898 0.876653
H  1.895218 -3.752816 -0.754785
H  4.236841 -3.818995 0.113725
H  -2.988658 -1.581939 -1.437242
H  -3.073972 1.469823 1.661285
H  -5.14919 -2.503169 -0.587126
H  -5.239533 0.552019 2.50373
H  -6.289693 -1.442185 1.387206
