program: Gaussian 09
title: 000254411
version: EM64L-G09RevD.01
frameworkgroup: C1[X(C13H22N6O3)]
method: RPBEPBE
basis: SDD
operation: Freq
keyword: #p
keyword: freq=noraman
keyword: PBEPBE/SDD
title: #p freq=noraman PBEPBE/SDD
converged: YES YES NO NO
title: Mulliken charges:
elementType: O O O N N N N N N C C C C C C C C C C C C C H H H H H H H H H H H H H H H H H H H H H H
charge: -0.179945 -0.194103 -0.240276 -0.156187 -0.117315 -0.131842 -0.149202 0.003864 -0.614988 0.240178 -0.380984 -0.357730 0.014574 -0.353683 -0.351510 0.184672 0.021894 -0.663746 -0.673487 -0.664661 -0.662214 0.165479 0.269633 0.212070 0.249005 0.216761 0.212663 0.243125 0.210475 0.249546 0.212445 0.257271 0.225753 0.242414 0.217163 0.215587 0.216554 0.214357 0.240173 0.215813 0.212843 0.240812 0.353609 0.333140
chargesum: 0.00000
title: Mulliken charges with hydrogens summed into heavy atoms:
elementType: O O O N N N N N N C C C C C C C C C C C C C
charge: -0.179945 -0.194103 -0.240276 -0.156187 -0.117315 -0.131842 -0.149202 0.003864 0.071762 0.240178 0.100720 0.108035 0.014574 0.102105 0.108512 0.184672 0.021894 0.031724 0.001677 0.006422 0.007255 0.165479
polarizability: 2.76232731e+02 7.53379795e+00 2.32139908e+02 5.04963424e+00 5.67956886e+00 1.37713960e+02
1716.lowfreq: -7.2668 -0.0003 0.0004 0.0008 2.8740 6.0146 29.3313 32.6801 42.8349
frequency: 29.2700 32.5923 42.7264 46.6184 47.8655 64.5105 69.2264 85.9837 105.9726 122.7362 136.6551 146.4577 159.8879 174.4364 187.6645 199.7582 205.7296 216.3566 216.9021 228.9075 235.2929 269.1118 296.5383 305.7820 310.0903 335.1398 354.8065 400.9383 432.1316 449.5983 471.5858 496.4437 508.0846 544.5466 548.4320 582.6222 597.7938 602.1814 612.0853 666.8689 690.5270 714.0430 739.4948 742.8201 765.4686 773.3625 776.6756 784.6049 792.2350 812.4177 826.0517 919.5009 934.5678 942.0387 974.8423 1026.6528 1034.5054 1067.9302 1069.2125 1076.4635 1078.4650 1084.4993 1091.5870 1096.1064 1096.8170 1172.1481 1182.9353 1192.2983 1212.3395 1231.3113 1267.4974 1282.5903 1296.3115 1302.3501 1317.9546 1326.1291 1341.6152 1346.2780 1358.7055 1360.3181 1361.4461 1371.2691 1379.8370 1380.8159 1383.9328 1395.6937 1436.4624 1450.9372 1456.3815 1462.4118 1465.4194 1466.8963 1468.0788 1468.5867 1479.1506 1481.4870 1481.9891 1484.1408 1485.2094 1510.1702 1538.1255 1549.6414 1559.9521 1642.2587 2983.5239 2983.6548 2987.0140 2994.3339 3000.7145 3004.5571 3007.5977 3027.8046 3066.8505 3068.4347 3074.3806 3077.5396 3083.7619 3083.9933 3089.9688 3091.8546 3097.3656 3099.0492 3105.9324 3111.1153 3487.7909 3667.9806
redmass: 4.8294 3.6507 2.9647 7.1620 3.2880 2.7756 3.2908 3.6072 7.0635 4.1196 3.1932 2.5711 4.2287 4.4622 4.8244 3.5018 1.1291 1.1113 6.7953 1.2999 1.2358 4.8787 2.6182 3.6748 2.9133 2.6035 3.7256 3.0160 3.6616 3.8727 3.3619 2.8267 3.4922 4.4816 3.0697 3.6533 3.0561 5.3322 2.7362 1.0758 9.9985 7.7868 7.4911 5.5143 1.7826 1.4384 1.2355 1.4013 9.1250 1.5472 2.6380 2.2183 2.2160 2.6496 3.0332 4.0549 3.3064 1.9521 2.3036 2.0726 2.0041 1.8769 2.5485 1.8260 1.7716 3.2459 2.2174 2.9943 4.3006 3.4769 2.1815 1.7899 1.3231 1.4210 1.7757 2.5931 1.4639 1.2520 1.5297 2.4121 1.9755 2.4698 1.2351 1.2442 1.3022 1.2358 2.4085 1.3808 1.1959 1.4627 1.0500 1.0541 1.1371 1.0517 1.6542 1.0834 1.0804 1.0738 1.0600 1.4731 1.5538 3.3993 2.6759 6.5169 1.0355 1.0354 1.0355 1.0359 1.0636 1.0662 1.0636 1.0632 1.0992 1.0994 1.0994 1.0999 1.0982 1.0988 1.0967 1.0973 1.1022 1.1023 1.1016 1.1019 1.0463 1.1026
irintensity: 4.7972 0.5592 0.3008 0.5443 0.3377 0.1954 1.4041 1.1587 2.9884 0.8349 4.3209 2.0502 0.2332 7.8616 1.1004 2.1421 0.0516 1.0031 2.2697 0.6048 0.0269 3.1265 2.2976 6.6175 4.9450 2.4387 9.0147 0.6498 4.8448 5.9717 32.1668 1.1134 3.5582 8.0303 33.3834 29.5610 48.5337 8.8455 66.5601 68.6252 4.8379 2.2336 26.6013 42.6522 6.5237 5.3516 4.1420 8.1240 1.5321 26.1348 7.8289 0.1198 3.2086 5.1726 4.9804 30.6361 23.6211 14.4480 1.0482 12.3851 36.0619 9.3761 20.3494 18.5094 21.2583 25.8179 8.3847 41.1273 85.1217 158.0739 14.0372 76.8242 3.6992 22.2223 16.7248 41.9170 46.5442 3.0457 123.4848 101.2829 123.7966 91.8057 19.5876 4.2108 24.2869 8.8592 192.2277 15.0535 14.6069 34.1438 5.5140 6.7965 34.8884 9.0527 12.5602 15.3576 7.5894 16.5935 15.3548 86.7521 561.0021 718.8831 259.9346 185.8802 27.8470 30.4782 25.2640 27.0789 35.5662 36.4103 56.6916 50.0927 5.2727 0.9914 11.2381 9.3092 65.9468 14.5859 29.1791 37.5526 6.9490 69.1581 17.9625 29.0103 37.8603 88.8116
temp: 298.150 k
press: 1.00000 atm
elementType: 8 8 8 7 7 7 7 7 7 6 6 6 6 6 6 6 6 6 6 6 6 6 1 1 1 1 1 1 1 1 1 1 1 1 1 1 1 1 1 1 1 1 1 1
symmnumber: 1
zpe: 939053.7 jmol-1
zpe.correction: 0.357667 hartree
zpe.thermalcorrener: 0.381809 hartree
zpe.thermalcorrenthalpy: 0.382753 hartree
zpe.thermalcorrgfe: 0.302866 hartree
zpe.sumelectzpe: -1060.998858 hartree
zpe.sumelectthermal: -1060.974716 hartree
zpe.sumelectthermalent: -1060.973771 hartree
zpe.sumelectthermalfe: -1061.053659 hartree
dipole: 7.1687 -4.7083 1.6912
dipole: 8.7418
quadrupole: -128.9579 -120.1037 -136.7111
quadrupole: 22.4035 -4.0095 4.4380
quadrupole: -0.3670 8.4872 -8.1202 22.4035 -4.0095 4.4380
hfenergy: -1061.3565246 hartree
pointgroup: C01 [X(C13H22N6O3)]
dipole: 2.9431052 -1.7692933 -0.1908904 debye
polarizability: 273.2723927|13.1464925|227.5256844|-16.8334407|21.4562336|145.2885214 unknown
InChI: InChI=1S/C13H22N6O3/c1-5-17(6-2)12-10(19(21)22)9(11(14)20)15-13(16-12)18(7-3)8-4/h5-8,14H2,1-4H3
charge 0 multiplicity 1
44 atoms
O  -3.133401 0.959361 1.605252
O  -3.323699 0.848764 -0.669474
O  -1.810129 3.382931 0.662463
N  -1.53835 -1.941439 -0.210016
N  2.803534 -0.199099 -0.386129
N  0.596067 -1.002437 -0.308061
N  1.105252 1.301983 0.270191
N  -2.633328 0.8240 0.424229
N  0.463288 3.75696 1.056916
C  -0.740244 -0.822038 -0.065409
C  -2.889492 -2.113188 0.397489
C  -0.942462 -3.158816 -0.82825
C  1.468631 0.034885 -0.139022
C  3.801828 0.885923 -0.264421
C  3.274046 -1.542764 -0.788393
C  -1.197453 0.508409 0.29938
C  -0.228718 1.522449 0.445631
C  -2.877437 -2.193972 1.941529
C  -0.348883 -4.157231 0.18883
C  4.388252 1.005026 1.159078
C  3.274967 -1.742938 -2.31959
C  -0.6166 2.969236 0.735877
H  -3.577799 -1.324739 0.053155
H  -3.282909 -3.059873 -0.012738
H  -0.151298 -2.831045 -1.519757
H  -1.742323 -3.643972 -1.41913
H  4.606807 0.679398 -0.994523
H  3.320483 1.834977 -0.552506
H  4.29466 -1.675142 -0.381958
H  2.616162 -2.291505 -0.317043
H  -2.268061 -3.043629 2.295267
H  -2.491048 -1.265046 2.392125
H  -3.911792 -2.329534 2.30663
H  0.44654 -3.67202 0.779452
H  -1.116998 -4.544929 0.881187
H  0.089559 -5.019988 -0.346295
H  5.154935 1.801018 1.194352
H  4.863255 0.059369 1.477932
H  3.592084 1.253429 1.881842
H  3.665507 -2.745072 -2.575929
H  3.907776 -0.990127 -2.824175
H  2.248927 -1.655965 -2.716164
H  1.393884 3.335359 1.015381
H  0.321485 4.746629 1.247801
