program: Gaussian 09
title: 000250342
version: EM64L-G09RevD.01
frameworkgroup: C1[X(C19H14N2)]
method: RPBEPBE
basis: SDD
operation: Freq
keyword: #pfreq=noraman
keyword: PBEPBE/SDD
title: #p freq=noraman PBEPBE/SDD
converged: YES YES NO NO
title: Mulliken charges:
elementType: N N C C C C C C C C C C C C C C C C C C C H H H H H H H H H H H H H H
charge: -0.405496 -0.027843 0.130895 0.348370 0.233474 -0.390406 0.385858 0.246521 -0.308917 -0.392083 -0.308196 -0.356117 -0.062709 -0.254829 -0.215309 -0.336411 -0.378438 -0.311309 -0.400088 -0.262392 -0.229220 0.261618 0.312089 0.217697 0.231530 0.201818 0.231000 0.224533 0.225422 0.221522 0.218156 0.260129 0.234078 0.225199 0.229855
chargesum: 0.00000
title: Mulliken charges with hydrogens summed into heavy atoms:
elementType: N N C C C C C C C C C C C C C C C C C C C
charge: -0.093407 -0.027843 0.130895 0.348370 0.233474 -0.128788 0.385858 0.246521 -0.091220 -0.160552 -0.106378 -0.125117 -0.062709 -0.030297 0.010114 -0.114890 -0.160281 -0.051179 -0.166010 -0.037193 0.000634
polarizability: 4.63825641e+02 -4.68924848e+00 2.42450741e+02 9.46990193e-01 2.39892424e+00 9.46302153e+01
1716.lowfreq: -4.6199 -3.5481 -0.0006 -0.0005 -0.0001 6.7954 15.7325 41.9787 44.2873
frequency: 15.2846 41.9766 44.2656 87.3166 116.7351 156.5669 172.4998 186.4538 201.1504 217.4628 265.9195 328.6234 362.2740 420.8326 427.2066 444.2044 471.1317 488.3613 498.8824 520.8197 540.6243 561.6631 565.7559 573.4358 578.2248 628.8118 629.5657 658.7363 712.7163 750.4680 751.0294 765.5439 769.6602 793.1320 803.1293 805.7848 817.8327 844.0232 854.3015 862.6079 867.0824 871.8268 883.1602 936.3210 953.5236 964.0070 964.5834 976.0528 994.2017 1010.2934 1013.6125 1028.7459 1054.9984 1089.1095 1104.3081 1137.6761 1145.6018 1168.7631 1173.4699 1219.6510 1231.2204 1247.8017 1252.1180 1262.4523 1287.7161 1309.5940 1319.7767 1326.5958 1349.9565 1376.1179 1382.0546 1400.9827 1422.8908 1433.1633 1451.0775 1457.3928 1482.7029 1502.9740 1542.0919 1544.0634 1570.2665 1588.7844 1619.9758 1629.9030 1635.2768 3099.4844 3117.1066 3118.0762 3127.9540 3128.3202 3135.4116 3142.3553 3148.8681 3155.0093 3157.3422 3166.1930 3171.4291 3226.2381 3605.0812
redmass: 5.0004 5.0161 5.0015 4.1015 3.7140 3.3186 4.3635 4.9042 3.9844 3.9563 4.3685 4.6344 4.8647 2.8215 3.2677 4.2417 3.1783 4.9946 6.5912 6.7766 1.4368 4.5298 6.9631 2.6450 3.6926 5.5160 3.0883 3.2166 5.9539 4.2110 1.3982 2.2908 1.8163 2.4123 2.6870 2.3659 3.7544 1.5168 1.5544 3.7492 3.5865 1.9958 2.2464 1.3865 1.3119 1.3278 1.2793 1.3066 1.3277 4.4708 2.1256 2.1336 3.1528 2.5922 1.6649 1.3637 1.3604 1.0929 1.1995 1.9827 1.6975 1.7888 2.3722 2.0538 1.6826 2.3710 1.6703 2.1336 1.9609 2.1409 3.7840 4.0818 2.5991 2.6409 2.6112 3.8380 2.9342 3.5914 5.6347 5.8366 6.4396 6.2838 6.3896 6.4170 5.8434 1.0898 1.0879 1.0880 1.0850 1.0850 1.0891 1.0890 1.0954 1.0943 1.0952 1.1003 1.0994 1.0977 1.0809
irintensity: 0.2612 0.1633 0.2487 0.5070 0.3514 0.3693 5.0850 0.1520 0.7619 9.6511 0.6690 10.3363 0.4225 6.1928 12.2239 2.8356 0.7787 2.1827 9.4972 0.7216 80.6799 3.6878 30.4688 13.7595 2.2117 9.3750 1.7512 4.2346 3.4974 16.5711 106.8201 11.7475 66.6686 17.4238 7.2280 5.7430 6.3667 16.7432 2.6294 15.6401 2.9208 4.5396 15.8214 1.4338 20.0567 10.3411 29.3829 0.7057 0.1358 1.6620 13.5091 9.7552 4.1711 3.5874 34.0484 36.6021 2.5749 0.4271 1.2784 8.4667 28.3588 38.4859 16.4625 3.1834 41.1015 1.6089 7.8961 59.6140 23.1198 144.9427 13.4288 8.5565 32.7567 11.3512 3.2700 37.2486 10.2232 124.0176 95.7669 48.9563 109.5089 4.4451 3.5898 52.6045 159.6510 3.9234 46.2700 2.6734 1.5625 0.1131 3.7374 18.3574 32.9559 26.9431 24.3658 34.2326 29.0898 0.1747 102.0127
temp: 298.150 k
press: 1.00000 atm
elementType: 7 7 6 6 6 6 6 6 6 6 6 6 6 6 6 6 6 6 6 6 6 1 1 1 1 1 1 1 1 1 1 1 1 1 1
symmnumber: 1
zpe: 720258.5 jmol-1
zpe.correction: 0.274332 hartree
zpe.thermalcorrener: 0.290300 hartree
zpe.thermalcorrenthalpy: 0.291245 hartree
zpe.thermalcorrgfe: 0.229111 hartree
zpe.sumelectzpe: -840.521407 hartree
zpe.sumelectthermal: -840.505439 hartree
zpe.sumelectthermalent: -840.504494 hartree
zpe.sumelectthermalfe: -840.566628 hartree
dipole: -4.6898 -3.9936 -0.5032
dipole: 6.1803
quadrupole: -115.5680 -102.4052 -129.6243
quadrupole: -2.1314 3.8078 3.5620
quadrupole: 0.2979 13.4606 -13.7585 -2.1314 3.8078 3.5620
hfenergy: -840.795739 hartree
pointgroup: C01 [X(C19H14N2)]
dipole: 1.9173548 0.9173185 -1.1809309 debye
polarizability: 462.2551106|-20.9631083|175.0397821|1.1419205|-74.0261156|163.6117045 unknown
InChI: InChI=1S/C19H14N2/c1-3-7-18-16(5-1)14(11-12-20-18)9-10-15-13-21-19-8-4-2-6-17(15)19/h1-13,21H
charge 0 multiplicity 1
35 atoms
N  3.735247 0.952471 -1.699571
N  -4.33389 -1.317243 1.131864
C  3.346196 -0.24576 0.204491
C  2.058318 0.077345 -0.408755
C  4.376442 0.315027 -0.625513
C  2.354109 0.810064 -1.57329
C  -1.769568 -0.360457 0.148129
C  -2.993052 0.377613 -0.131841
C  0.756742 -0.310487 0.108853
C  3.72114 -0.949909 1.377552
C  -0.470465 0.092804 -0.363187
C  5.750028 0.191628 -0.325616
C  -4.246703 -0.151607 0.3767
C  5.089516 -1.080414 1.685707
C  6.09344 -0.516717 0.843798
C  -1.902504 -1.540893 0.911505
C  -3.031029 1.607039 -0.868404
C  -5.470041 0.544141 0.10991
C  -3.176421 -1.965532 1.380259
C  -4.238486 2.268265 -1.111521
C  -5.470729 1.73171 -0.623422
H  1.680396 1.221904 -2.322234
H  4.20706 1.433447 -2.462709
H  0.784577 -0.980001 0.980035
H  2.964003 -1.384496 2.039566
H  -0.490455 0.816403 -1.187597
H  6.523224 0.62562 -0.969151
H  5.392917 -1.622138 2.588174
H  7.148959 -0.635259 1.111857
H  -1.030662 -2.167066 1.124294
H  -2.101189 2.052008 -1.236591
H  -6.389796 0.105649 0.509155
H  -3.259357 -2.885249 1.972474
H  -4.242023 3.207663 -1.67564
H  -6.410644 2.258429 -0.821782
