program: Gaussian 09
title: 000250341
version: EM64L-G09RevD.01
frameworkgroup: C1[X(C20H19NO3)]
method: RPBEPBE
basis: SDD
operation: Freq
keyword: #p
keyword: freq=noraman
keyword: PBEPBE/SDD
title: #p freq=noraman PBEPBE/SDD
converged: YES YES NO NO
title: Mulliken charges:
elementType: O O O N C C C C C C C C C C C C C C C C C C C C H H H H H H H H H H H H H H H H H H H
charge: -0.304143 -0.289261 -0.307493 -0.023848 0.248191 0.389063 0.632314 -0.065681 -0.298300 -0.339742 -0.570718 -0.606416 0.262849 0.250271 0.020568 -0.373219 -0.327901 -0.309651 -0.262195 -0.398768 -0.227972 -0.527333 -0.525241 -0.524177 0.210391 0.229171 0.250408 0.255246 0.219900 0.221464 0.261304 0.227783 0.236240 0.231479 0.228692 0.235015 0.255850 0.231325 0.223557 0.252862 0.262581 0.214908 0.230625
chargesum: 0.00000
title: Mulliken charges with hydrogens summed into heavy atoms:
elementType: O O O N C C C C C C C C C C C C C C C C C C C C
charge: -0.304143 -0.289261 -0.307493 -0.023848 0.248191 0.389063 0.632314 -0.065681 -0.087909 -0.110571 -0.320310 -0.351170 0.262849 0.250271 0.020568 -0.153319 -0.106438 -0.048347 -0.034412 -0.162528 0.003508 0.180411 0.182874 0.195380
polarizability: 4.87483841e+02 -9.51659042e+00 2.68050471e+02 -9.44099211e-01 7.82738504e+00 1.17614786e+02
1716.lowfreq: -10.4162 -1.0039 -0.0003 0.0007 0.0008 3.7537 7.7765 32.7261 40.2130
frequency: 6.0592 32.6318 40.2067 60.9265 68.7939 80.7826 93.2223 96.1801 122.6617 138.2972 151.2402 154.7520 158.2445 166.3604 174.5542 188.8796 211.8516 233.3024 245.9834 281.7236 305.0712 320.0374 350.4782 371.3782 420.3006 432.5388 451.6744 470.4610 489.5447 492.2968 518.9046 524.0727 556.5630 567.6796 599.4743 627.8653 634.5776 655.4395 666.9116 719.4147 767.1001 767.6948 774.4279 795.2698 806.4939 843.7049 858.0248 862.9069 869.3440 881.1196 882.4982 899.2647 915.0627 938.5579 958.0758 966.6301 976.0237 996.0439 1005.7514 1018.9552 1032.2515 1037.5905 1087.5496 1110.8540 1111.9994 1113.5414 1122.0061 1145.5551 1150.5390 1156.4911 1159.4377 1175.5917 1194.6338 1217.2563 1222.2210 1245.3911 1260.7838 1281.3771 1317.7978 1325.9519 1338.1004 1362.8241 1380.2673 1384.2951 1403.2706 1418.8475 1432.1487 1434.4230 1440.3441 1451.0038 1456.8631 1457.5720 1459.3400 1466.5332 1476.0902 1483.8837 1486.3699 1506.6347 1545.0316 1559.1525 1570.1306 1602.5600 1620.7255 1637.4071 2973.8378 2975.5238 2980.3470 3071.9425 3081.6207 3082.9898 3098.3013 3120.3617 3123.3939 3124.1402 3126.9712 3128.2834 3132.0559 3144.1703 3150.0678 3155.8544 3159.1420 3163.9958 3172.0604
redmass: 4.9258 4.5291 4.9983 3.6821 2.9091 2.8742 3.1605 2.8175 3.2157 1.4673 1.3686 2.0798 1.1795 3.0483 4.2590 4.3571 2.9721 3.5040 4.4069 5.1813 5.2850 4.2227 5.3743 5.3616 4.0015 4.1660 5.0611 3.1636 6.4392 5.4791 6.0261 6.5543 7.1725 3.7324 4.8255 3.9189 4.3460 5.0003 3.4449 5.5058 2.0864 2.5317 3.0422 2.6614 5.5221 1.3731 3.8137 2.3868 2.4682 1.9566 2.0090 2.0558 5.5604 9.3545 1.4035 1.4041 1.1845 1.3289 4.5005 3.3980 2.2319 5.0433 2.5122 1.2472 1.2784 1.2412 2.7292 1.3755 1.3533 1.4627 1.4681 1.2324 1.9652 1.5242 1.8830 1.6412 2.5019 1.8521 3.2981 1.8620 2.2582 4.2212 2.9881 2.5656 1.9569 1.2704 2.5566 1.2805 1.6456 2.4406 1.2329 1.0659 1.0843 2.1149 1.0599 1.0544 1.0564 3.6506 6.1135 6.9570 6.4131 6.5408 6.3671 5.2006 1.0312 1.0337 1.0295 1.1038 1.1050 1.0992 1.0898 1.0889 1.1029 1.1034 1.0867 1.1043 1.0865 1.0888 1.0918 1.0946 1.0950 1.0911 1.0995
irintensity: 0.1210 0.3310 0.0455 2.7874 3.7696 3.9797 2.0674 8.6803 0.3980 0.6785 0.3145 0.4939 0.3478 3.6943 3.8288 1.9198 5.0837 11.7100 8.0244 10.4843 2.0481 3.1545 8.8903 2.1351 8.0779 2.9431 1.7961 0.4997 16.0269 3.8347 0.4236 1.3696 25.2213 9.5223 2.8642 3.2958 1.5864 10.6282 2.0823 3.5340 27.5076 39.8409 13.6873 11.0154 4.6275 14.2585 10.5721 9.9592 17.2597 7.2215 20.1822 5.4732 40.1396 81.2928 8.6091 2.1394 59.7177 0.0216 46.0856 60.9462 4.2679 145.9552 4.9758 18.4988 9.5142 5.8332 21.9479 6.6682 1.3964 5.8508 16.4220 1.6087 45.1173 14.4317 1.7803 29.0559 7.5298 146.8567 149.4458 20.6782 73.7096 18.0242 3.6688 3.7015 40.4885 6.5138 18.5576 44.9513 19.0643 12.1816 40.3605 19.9586 1.8621 79.1457 3.5894 17.5149 42.1804 50.7955 14.5599 97.6664 76.0254 32.6730 2.6642 62.9953 63.8557 109.7302 76.6330 26.4319 17.6693 34.9680 12.1385 29.2748 24.1469 29.5484 9.7282 14.7090 2.4789 20.0056 2.6726 24.5915 24.6559 2.7800 27.0923
temp: 298.150 k
press: 1.00000 atm
elementType: 8 8 8 7 6 6 6 6 6 6 6 6 6 6 6 6 6 6 6 6 6 6 6 6 1 1 1 1 1 1 1 1 1 1 1 1 1 1 1 1 1 1 1
symmnumber: 1
zpe: 888059.7 jmol-1
zpe.correction: 0.338244 hartree
zpe.thermalcorrener: 0.360994 hartree
zpe.thermalcorrenthalpy: 0.361938 hartree
zpe.thermalcorrgfe: 0.283590 hartree
zpe.sumelectzpe: -1052.180113 hartree
zpe.sumelectthermal: -1052.157364 hartree
zpe.sumelectthermalent: -1052.156419 hartree
zpe.sumelectthermalfe: -1052.234767 hartree
dipole: 5.1131 1.3008 1.3597
dipole: 5.4484
quadrupole: -131.8990 -129.4005 -142.4971
quadrupole: -10.0585 1.2658 2.0639
quadrupole: 2.6999 5.1984 -7.8982 -10.0585 1.2658 2.0639
hfenergy: -1052.5183572 hartree
pointgroup: C01 [X(C20H19N1O3)]
dipole: 2.042073 -0.3806858 -0.5290436 debye
polarizability: 486.2921238|14.1826735|263.7416163|14.2173452|28.5185413|123.1153582 unknown
InChI: InChI=1S/C20H19NO3/c1-22-18-12-14(13-19(23-2)20(18)24-3)8-9-15-10-11-21-17-7-5-4-6-16(15)17/h4-13H,1-3H3
charge 0 multiplicity 1
43 atoms
O  4.531806 2.335432 0.199976
O  3.311048 -2.468417 0.309584
O  5.367085 -0.436114 0.310351
N  -5.446753 1.546087 0.35897
C  -3.774896 -0.253528 -0.122195
C  -2.687557 0.645602 0.23436
C  1.222059 0.605665 0.195153
C  -5.135828 0.248618 -0.034823
C  -1.286754 0.198619 0.198418
C  -0.188259 1.019921 0.202339
C  1.637096 -0.755282 0.195962
C  2.22343 1.616116 0.166607
C  3.590065 1.281432 0.168892
C  3.002561 -1.100588 0.20778
C  4.00126 -0.080549 0.227825
C  -3.583852 -1.603109 -0.567606
C  -3.045723 1.949619 0.636045
C  -6.232512 -0.60997 -0.369018
C  -4.671965 -2.419343 -0.889056
C  -4.410439 2.350212 0.674631
C  -6.008969 -1.922626 -0.786397
C  5.472055 2.37295 -0.94511
C  4.273931 -3.017692 -0.671825
C  6.003094 -0.069323 1.602649
H  -1.121839 -0.884427 0.164828
H  -0.345232 2.107858 0.193929
H  0.915909 -1.577414 0.207014
H  1.951615 2.676804 0.140822
H  -2.572443 -2.007772 -0.67296
H  -2.281557 2.665433 0.953738
H  -7.238944 -0.188786 -0.284334
H  -4.500192 -3.447473 -1.22649
H  -4.670516 3.368423 0.988748
H  -6.852748 -2.573452 -1.040257
H  7.055498 -0.377635 1.509508
H  5.516417 -0.61889 2.428732
H  5.93087 1.019757 1.771719
H  6.141687 3.222463 -0.742696
H  4.915462 2.547643 -1.885273
H  6.047206 1.432808 -1.016209
H  5.24325 -2.497076 -0.6069
H  3.861087 -2.932209 -1.695611
H  4.381185 -4.078789 -0.400423
