program: Gaussian 09
title: 000250339
version: EM64L-G09RevD.01
frameworkgroup: C1[X(C19H17NO2)]
method: RPBEPBE
basis: SDD
operation: Freq
keyword: #p
keyword: freq=noraman
keyword: PBEPBE/SDD
title: #p freq=noraman PBEPBE/SDD
converged: YES YES NO NO
title: Mulliken charges:
elementType: O O N C C C C C C C C C C C C C C C C C C C H H H H H H H H H H H H H H H H H
charge: -0.281764 -0.263069 -0.028121 0.248373 0.390380 -0.065433 0.362338 -0.299566 -0.306062 0.206854 -0.373982 -0.330084 -0.378875 -0.311602 -0.521311 0.333109 -0.264463 -0.394574 -0.401638 -0.229768 -0.533032 -0.535391 0.200248 0.261681 0.216703 0.222486 0.226483 0.259818 0.264795 0.225119 0.242556 0.233552 0.229458 0.226088 0.226691 0.246568 0.246865 0.224198 0.224372
chargesum: 0.00000
title: Mulliken charges with hydrogens summed into heavy atoms:
elementType: O O N C C C C C C C C C C C C C C C C C C C
charge: -0.281764 -0.263069 -0.028121 0.248373 0.390380 -0.065433 0.362338 -0.099319 -0.044381 0.206854 -0.157279 -0.107598 -0.152392 -0.051784 -0.256517 0.333109 -0.039343 -0.152018 -0.168086 -0.000309 0.166315 0.160044
polarizability: 4.77872351e+02 -6.74649380e+00 2.62239120e+02 -6.59350828e-01 -7.22125405e+00 9.98320431e+01
1716.lowfreq: -0.0011 -0.0009 -0.0005 1.8101 4.2595 8.1721 12.4337 38.2373 44.6999
frequency: 11.9392 38.1468 44.6879 73.6441 92.7417 103.8738 119.1192 149.9081 153.7692 171.7189 178.6353 202.7194 210.2915 232.8840 264.8886 273.7659 278.0631 360.2232 371.2851 402.5050 426.5031 454.8988 465.3188 472.1034 483.5032 505.4411 531.0811 540.9064 574.2236 582.3055 621.8128 623.3789 651.0708 698.9996 727.5381 732.9340 768.4853 791.2274 799.6104 805.4601 826.8733 847.7009 854.0801 865.0303 876.4756 883.1771 889.9303 932.2572 958.4165 965.8927 988.3294 989.8610 994.5772 1011.6353 1016.5262 1031.8941 1087.1040 1110.5522 1112.1198 1115.5301 1144.2324 1145.6576 1159.6116 1173.5937 1178.7993 1210.9161 1222.0859 1248.7990 1252.1667 1276.4996 1290.8582 1305.9253 1323.5062 1336.6230 1375.7905 1383.3869 1393.8751 1422.9943 1432.8274 1435.7688 1451.0296 1452.2986 1467.8492 1469.0019 1471.0860 1474.1559 1494.6628 1510.2696 1544.3814 1568.4329 1571.3722 1614.4972 1620.1917 1631.9692 2964.5798 2965.8138 3054.5123 3056.2682 3118.2667 3121.6328 3128.3225 3128.5356 3128.6928 3139.8779 3141.0828 3143.9408 3158.0858 3158.4545 3170.8861 3172.4187 3182.6405
redmass: 4.6102 5.0419 4.9963 4.0105 3.2054 3.1958 3.1002 4.2169 3.4018 4.2001 3.5916 1.8024 4.7095 1.2590 3.3541 1.7179 3.3219 4.9158 4.2621 4.7969 3.0101 4.0006 3.4157 3.3040 6.2252 6.7353 7.2166 6.0185 4.0729 3.8584 4.0246 6.0617 3.2652 6.2819 5.2024 2.7009 1.4317 1.8621 1.9338 5.5409 3.9114 1.4502 1.6926 4.1638 1.7404 2.6653 4.3668 1.3828 1.3977 1.4145 7.8060 1.2128 1.3047 3.8793 3.5385 2.1130 2.5644 2.0705 1.3198 1.2587 1.4975 1.3643 1.3665 1.3193 1.6371 1.5940 1.9651 1.7280 3.4401 2.1289 1.7256 1.9584 1.7152 2.1453 2.5831 3.2208 3.1267 2.2516 2.6128 1.2266 2.5395 1.5437 1.0498 1.0598 1.1467 1.0699 2.4877 3.4999 5.9694 6.0266 7.3302 5.8025 6.3714 5.4791 1.0327 1.0326 1.1042 1.1042 1.0891 1.0895 1.0873 1.0987 1.0996 1.0882 1.0885 1.0875 1.0945 1.0940 1.0994 1.0947 1.0908
irintensity: 0.0461 0.1154 0.0757 1.7142 9.6158 1.9918 0.6047 0.7979 0.8930 4.3789 0.8976 2.2605 4.1198 0.2241 0.8314 1.0922 2.1260 9.4443 0.4833 7.3818 4.6735 3.8611 6.5927 0.9866 27.7423 3.6481 13.6566 16.7667 2.6981 3.0778 6.8168 12.2670 0.4933 5.1574 0.8932 1.8491 69.0284 33.0521 4.1769 4.8885 8.9931 31.0942 33.0276 7.0837 1.2576 17.2149 7.4368 0.8797 0.6106 2.8167 41.1000 49.0873 3.3059 34.6094 45.0264 10.8770 11.8004 63.3265 7.0937 0.2626 28.3224 26.4429 12.8151 47.2126 95.3777 34.2888 0.8980 39.7346 172.5758 199.5526 35.4829 24.5763 9.1620 42.9530 17.9601 5.5687 109.5574 35.8417 14.6864 23.3953 5.8968 47.1995 13.2251 21.4095 68.5629 34.5390 4.9374 124.3191 23.1618 277.4770 19.9650 288.6000 1.6641 44.1881 88.3869 77.6311 40.7159 46.0185 32.4987 10.4419 0.9484 30.6805 14.6559 8.4679 14.4336 17.2526 41.4528 8.0418 28.8627 15.5444 5.2265
temp: 298.150 k
press: 1.00000 atm
elementType: 8 8 7 6 6 6 6 6 6 6 6 6 6 6 6 6 6 6 6 6 6 6 1 1 1 1 1 1 1 1 1 1 1 1 1 1 1 1 1
symmnumber: 1
zpe: 809505.2 jmol-1
zpe.correction: 0.308324 hartree
zpe.thermalcorrener: 0.327709 hartree
zpe.thermalcorrenthalpy: 0.328654 hartree
zpe.thermalcorrgfe: 0.258881 hartree
zpe.sumelectzpe: -937.845599 hartree
zpe.sumelectthermal: -937.826214 hartree
zpe.sumelectthermalent: -937.825270 hartree
zpe.sumelectthermalfe: -937.895042 hartree
dipole: 6.1224 -2.0828 0.1863
dipole: 6.4697
quadrupole: -123.5652 -102.7685 -135.4274
quadrupole: 6.4594 -1.7440 1.1893
quadrupole: -2.9782 17.8186 -14.8404 6.4594 -1.7440 1.1893
hfenergy: -938.1539231 hartree
pointgroup: C01 [X(C19H17N1O2)]
dipole: 2.4737905 0.0418004 0.5978955 debye
polarizability: 477.1743708|6.2894547|100.2400504|-12.9898079|-10.3056452|262.529093 unknown
InChI: InChI=1S/C19H17NO2/c1-21-16-10-9-15(19(13-16)22-2)8-7-14-11-12-20-18-6-4-3-5-17(14)18/h3-13H,1-2H3
charge 0 multiplicity 1
39 atoms
O  2.29855 0.713271 -2.50444
O  5.945098 0.086282 0.615892
N  -4.902326 -0.142247 -1.080319
C  -3.204171 -0.019967 0.755633
C  -2.123944 -0.091918 -0.219122
C  -4.572883 -0.056722 0.268714
C  1.774095 0.078385 -0.245743
C  -0.716629 -0.094056 0.20179
C  0.360895 0.105032 -0.627867
C  2.779333 0.397215 -1.226568
C  -2.998113 0.09773 2.169976
C  -2.50183 -0.182136 -1.576626
C  2.236753 -0.251364 1.055383
C  -5.659618 0.002595 1.200173
C  4.149559 0.389054 -0.904951
C  4.560076 0.060285 0.409671
C  -4.076689 0.1570 3.057215
C  3.60126 -0.265471 1.401673
C  -3.873054 -0.195882 -1.952126
C  -5.420394 0.105047 2.571242
C  3.274058 1.050511 -3.544194
C  6.438954 -0.237243 1.958112
H  -0.530168 -0.265323 1.268237
H  0.184213 0.328418 -1.686032
H  -1.982024 0.155793 2.572354
H  -1.744086 -0.269129 -2.360939
H  1.504095 -0.514294 1.825607
H  -6.672113 -0.031985 0.7863
H  4.924189 0.630694 -1.636294
H  -3.89264 0.248446 4.133546
H  3.900436 -0.529042 2.419439
H  -4.145815 -0.266629 -3.012341
H  -6.257194 0.151168 3.276856
H  3.958901 0.203286 -3.740828
H  3.860352 1.947273 -3.266203
H  2.674359 1.260896 -4.441619
H  7.532889 -0.149331 1.88914
H  6.164339 -1.269539 2.248646
H  6.052694 0.477301 2.710214
