program: Gaussian 09
title: 000250337
version: EM64L-G09RevD.01
frameworkgroup: C1[X(C18H15NO)]
method: RPBEPBE
basis: SDD
operation: Freq
keyword: #p
keyword: freq=noraman
keyword: PBEPBE/SDD
title: #p freq=noraman PBEPBE/SDD
converged: YES YES NO NO
title: Mulliken charges:
elementType: O N C C C C C C C C C C C C C C C C C C H H H H H H H H H H H H H H H
charge: -0.259350 -0.026091 0.248132 0.384865 -0.063941 -0.308508 -0.374786 -0.330564 0.512135 -0.321268 -0.309773 -0.261933 -0.397811 -0.228201 -0.369740 -0.410449 0.319404 -0.364400 -0.371316 -0.536562 0.205999 0.219776 0.221200 0.221767 0.260725 0.226970 0.234964 0.230836 0.227855 0.228468 0.252256 0.242731 0.248520 0.223934 0.224153
chargesum: 0.00000
title: Mulliken charges with hydrogens summed into heavy atoms:
elementType: O N C C C C C C C C C C C C C C C C C C
charge: -0.259350 -0.026091 0.248132 0.384865 -0.063941 -0.102509 -0.155011 -0.109364 0.512135 -0.099501 -0.049048 -0.034963 -0.162847 0.002635 -0.141885 -0.181981 0.319404 -0.112144 -0.128585 0.160046
polarizability: 4.68675834e+02 -5.94283213e+00 2.22094526e+02 -2.77031302e+00 4.03124218e+00 8.92783267e+01
1716.lowfreq: -5.0395 -3.2290 -0.0007 -0.0005 0.0004 4.0567 22.5800 33.8429 46.2399
frequency: 22.2515 33.8340 46.2309 72.1474 113.3466 128.1662 168.9726 171.2762 178.3781 186.3270 230.8142 256.0993 272.7186 367.7866 389.3119 415.7640 422.2090 431.2234 470.7368 479.7619 499.6706 513.7957 526.4385 540.0095 581.8834 615.1353 633.9383 650.4239 711.8855 732.8612 761.8440 770.2961 794.0821 806.0578 810.2670 830.9028 839.6891 851.3283 866.8875 874.2203 885.4990 939.2534 957.5969 964.9416 965.6351 974.8699 984.2528 995.2925 998.4148 1014.2151 1030.7881 1087.6038 1111.4744 1114.7462 1144.5481 1156.2540 1173.8342 1178.9811 1220.4300 1223.3355 1238.9050 1248.3887 1266.2576 1293.7611 1311.2722 1325.8119 1334.2408 1373.7721 1382.7673 1391.1260 1431.4389 1432.6705 1436.0814 1451.2832 1466.8487 1471.3534 1499.1476 1509.8729 1544.4781 1567.3068 1571.7969 1617.8513 1620.5733 1634.8440 2964.2365 3054.3899 3090.2142 3118.6720 3122.6348 3124.2479 3128.9363 3129.9813 3139.5076 3142.9346 3156.7152 3157.7644 3164.8550 3169.9719 3171.5088
redmass: 3.5536 5.0446 5.0576 4.1898 3.6568 3.2640 3.4547 3.6745 4.0086 3.2559 1.3534 3.7177 3.6933 4.4187 4.6312 2.8894 5.1722 3.2477 3.1503 4.7017 5.8252 2.8296 5.3820 5.3037 3.4911 6.3927 6.8763 3.3240 5.5426 3.3353 3.5940 1.6311 2.5749 5.5840 1.3422 1.5068 2.1555 2.5044 3.1578 1.7702 2.2951 1.3274 1.4109 1.3561 1.3986 1.2181 8.7683 1.3290 2.6519 4.0005 2.0997 2.5382 1.2605 1.3860 1.3553 1.3305 1.2071 1.2574 1.9772 1.8701 3.4552 1.8278 1.6789 1.8226 1.6786 1.5222 2.4922 2.5619 3.6396 2.6862 3.1588 3.0793 1.2092 2.5946 1.0507 1.0741 2.7282 3.3278 6.0790 6.6387 6.4530 6.0231 6.3906 5.4223 1.0327 1.1042 1.0893 1.0890 1.0884 1.0884 1.0995 1.0855 1.0880 1.0886 1.0944 1.0950 1.0937 1.0961 1.0996
irintensity: 1.0718 0.0205 0.2202 1.3401 4.1883 1.0282 2.1081 1.6716 0.5731 3.5620 0.3215 7.3336 3.7323 0.5660 1.4996 0.5251 3.4280 5.6064 0.8612 8.5850 21.2586 17.2245 6.6510 26.7613 0.5996 8.4728 0.4738 0.8791 5.0065 0.7683 13.4206 66.3050 19.4403 5.6625 6.7368 25.7848 36.2929 22.2506 8.4960 0.5396 10.7691 10.7104 2.9940 8.0811 0.7314 41.1669 69.1053 0.0788 6.9660 9.4583 4.2116 3.2187 0.2603 10.4000 4.9433 3.5091 17.8728 177.9682 2.0079 2.5233 281.7481 2.5805 51.8299 9.8808 1.9704 7.8582 24.8270 7.2878 5.9032 5.9818 10.3210 49.4773 9.6054 1.8342 15.2826 62.6307 35.5160 173.4207 19.6271 204.2602 13.4354 213.9497 2.0840 22.0565 100.9566 45.7881 11.4699 32.2308 1.6455 30.4341 20.6811 0.7698 11.2091 14.4900 31.3235 18.2659 20.8197 10.0881 27.8444
temp: 298.150 k
press: 1.00000 atm
elementType: 8 7 6 6 6 6 6 6 6 6 6 6 6 6 6 6 6 6 6 6 1 1 1 1 1 1 1 1 1 1 1 1 1 1 1
symmnumber: 1
zpe: 726428.5 jmol-1
zpe.correction: 0.276682 hartree
zpe.thermalcorrener: 0.293344 hartree
zpe.thermalcorrenthalpy: 0.294288 hartree
zpe.thermalcorrgfe: 0.230718 hartree
zpe.sumelectzpe: -823.494133 hartree
zpe.sumelectthermal: -823.477471 hartree
zpe.sumelectthermalent: -823.476527 hartree
zpe.sumelectthermalfe: -823.540097 hartree
dipole: -5.2186 -0.1336 0.5554
dipole: 5.2498
quadrupole: -102.0370 -105.1743 -123.6731
quadrupole: -18.7788 -3.3824 1.7436
quadrupole: 8.2578 5.1205 -13.3783 -18.7788 -3.3824 1.7436
hfenergy: -823.770815 hartree
pointgroup: C01 [X(C18H15N1O1)]
dipole: 2.0516435 0.052715 0.232284 debye
polarizability: 468.0004107|-11.2991782|211.3710593|9.5350309|-37.3960771|100.677216 unknown
InChI: InChI=1S/C18H15NO/c1-20-16-10-7-14(8-11-16)6-9-15-12-13-19-18-5-3-2-4-17(15)18/h2-13H,1H3
charge 0 multiplicity 1
35 atoms
O  6.245825 0.730128 -0.238188
N  -4.4749 -1.506853 0.323109
C  -2.854024 0.360716 -0.065547
C  -1.737349 -0.561816 0.076288
C  -4.201582 -0.168742 0.058291
C  -0.347933 -0.107565 -0.077325
C  -2.702961 1.765939 -0.307529
C  -2.057812 -1.911296 0.336915
C  2.164644 -0.384904 0.198015
C  0.762888 -0.783992 0.363186
C  -5.324671 0.708125 -0.088912
C  -3.816146 2.600309 -0.443158
C  -3.412593 -2.327672 0.459517
C  -5.139635 2.068601 -0.338564
C  2.579156 0.7654 -0.544041
C  3.182511 -1.175827 0.800458
C  4.92837 0.297673 -0.050594
C  3.932521 1.103406 -0.667262
C  4.54996 -0.851649 0.686937
C  7.317641 -0.058802 0.377522
H  -0.202803 0.853466 -0.584642
H  -1.70261 2.205436 -0.373904
H  -1.269248 -2.665852 0.415052
H  0.614628 -1.719205 0.922838
H  -6.320142 0.264022 0.007512
H  -3.675004 3.671288 -0.626314
H  -3.642815 -3.380879 0.662211
H  -6.003796 2.732723 -0.449192
H  1.832913 1.397709 -1.036751
H  2.893426 -2.064947 1.374678
H  4.252998 1.981554 -1.23591
H  5.297838 -1.488274 1.16826
H  8.248027 0.460005 0.105012
H  7.335245 -1.091462 -0.020941
H  7.213235 -0.085263 1.479278
