program: Gaussian 09
title: 000254351
version: EM64L-G09RevD.01
frameworkgroup: C1[X(C12H16Cl2N3O3P)]
method: RPBEPBE
basis: SDD
operation: Freq
keyword: #p
keyword: freq=noraman
keyword: PBEPBE/SDD
title: #p freq=noraman PBEPBE/SDD
converged: YES YES NO NO
title: Mulliken charges:
elementType: Cl Cl P O O O N N N C C C C C C C C C C C C H H H H H H H H H H H H H H H H
charge: -0.054851 -0.049025 1.340184 -0.570577 -0.297540 -0.256839 -0.495395 -0.871707 -0.844743 0.413845 0.371952 -0.297569 -0.307101 -0.487723 -0.351245 -0.563771 -0.560137 0.301470 -0.367270 0.160027 -0.499140 0.340015 0.335141 0.232095 0.277003 0.245425 0.267743 0.275434 0.236188 0.291565 0.256623 0.279316 0.264595 0.271446 0.242776 0.229286 0.242503
chargesum: 0.00000
title: Mulliken charges with hydrogens summed into heavy atoms:
elementType: Cl Cl P O O O N N N C C C C C C C C C C C C
charge: -0.054851 -0.049025 1.340184 -0.570577 -0.297540 -0.256839 -0.495395 -0.531693 -0.509601 0.413845 0.371952 0.211529 0.206068 -0.212289 -0.115058 -0.015584 -0.016225 0.301470 -0.095823 0.160027 0.215426
polarizability: 3.17562092e+02 -2.18601063e+01 1.61320084e+02 1.52428174e+01 1.03319456e+01 1.67498654e+02
1716.lowfreq: -5.3992 -2.7618 -0.0026 -0.0024 -0.0012 4.0808 17.4582 23.8931 33.8138
frequency: 17.4485 23.8752 33.7237 38.2756 59.2748 72.7949 84.7776 88.6230 97.0799 99.1234 106.4220 121.4461 168.8531 189.1731 201.0686 213.7404 218.5800 223.7786 241.4789 280.4467 298.7018 303.0115 331.0230 343.2433 389.5487 392.8894 435.9476 459.0883 482.4528 498.7725 514.9392 521.5184 575.1823 608.5435 641.4887 665.4099 693.2283 707.6786 715.7570 747.3317 765.6782 775.2989 777.8118 780.5799 782.4279 824.0414 834.2976 895.7128 907.0432 950.6660 954.8025 967.5123 999.4713 1031.8616 1040.3918 1047.4616 1058.5818 1061.5181 1113.9433 1116.0391 1124.0383 1148.5003 1194.9650 1207.9382 1214.9667 1231.2761 1246.8341 1253.0576 1256.2116 1282.9908 1291.0808 1310.0461 1326.8295 1331.0990 1348.2786 1364.1124 1420.5271 1423.4960 1448.3209 1451.1484 1453.4097 1460.2544 1464.9160 1470.5987 1474.2949 1501.6994 1596.4441 1621.2603 1627.1204 3002.6364 3005.5015 3019.0579 3056.3674 3060.9949 3069.9413 3089.8459 3103.5006 3145.2905 3147.1099 3147.1315 3149.2296 3170.9383 3175.3618 3601.9393 3611.9226
redmass: 9.4181 10.4456 12.7374 6.5886 5.7002 5.3513 2.3406 2.5535 2.6592 2.3746 2.2157 3.8674 4.4715 6.5911 4.0390 4.9760 8.6235 6.3977 4.2910 4.8752 6.1075 4.2786 5.3897 4.2560 7.5732 3.9417 2.9380 3.9848 5.9385 1.3409 1.7428 3.4588 5.2335 6.6202 7.1373 8.3978 5.3920 4.6060 5.1041 6.2515 3.5772 1.4066 2.6664 1.4064 3.7727 4.1753 1.5144 7.2629 1.5533 2.8140 4.1132 1.3732 1.4500 5.4372 2.5714 3.7878 3.4771 2.1732 1.2637 1.5369 1.5679 1.4650 2.2292 2.4917 1.4440 1.6070 1.8002 1.1698 1.1656 2.1816 1.1584 1.3941 3.4997 1.2720 1.2410 1.2465 3.7280 1.1977 1.0806 1.0498 1.0939 1.0865 1.0562 4.0729 1.0827 3.9982 7.1189 8.6280 8.4145 1.0295 1.0609 1.0618 1.0566 1.0576 1.1021 1.1027 1.1044 1.1046 1.0955 1.1059 1.1119 1.0953 1.0935 1.0786 1.0788
irintensity: 0.0134 0.2217 0.7416 0.6889 2.0152 3.2023 2.6929 1.0497 1.4891 0.8350 0.4334 2.3319 2.7678 3.7762 3.0097 1.3701 2.0461 8.9656 3.0508 18.0655 8.7976 31.3446 1.2704 5.3129 36.7249 4.4739 20.4518 19.2637 8.4072 18.1076 230.6691 29.6487 0.9807 4.8189 6.9245 3.0175 93.8377 136.4943 53.2396 4.8018 5.0925 101.5980 70.4040 1.7772 48.5930 140.6235 35.8213 5.7702 24.6230 205.1727 11.8981 0.7131 2.4048 117.2148 33.7776 12.2484 177.6210 32.8795 0.0554 47.9475 99.1598 44.0476 158.5575 96.1843 20.2337 17.3964 62.5613 18.7339 10.3266 69.0672 5.4797 95.5722 534.1359 71.9953 2.4835 0.9544 30.0040 38.5331 10.3820 13.4583 1.5322 32.1742 11.9513 78.4434 12.8816 246.6901 54.3924 192.0339 73.1773 48.1205 12.5730 15.5924 15.3729 16.8456 6.8260 0.7849 26.9106 16.8990 7.7720 6.1782 15.1268 4.0471 3.1448 76.3518 51.4124
temp: 298.150 k
press: 1.00000 atm
elementType: 17 17 15 8 8 8 7 7 7 6 6 6 6 6 6 6 6 6 6 6 6 1 1 1 1 1 1 1 1 1 1 1 1 1 1 1 1
symmnumber: 1
zpe: 727888.0 jmol-1
zpe.correction: 0.277238 hartree
zpe.thermalcorrener: 0.299896 hartree
zpe.thermalcorrenthalpy: 0.300841 hartree
zpe.thermalcorrgfe: 0.221676 hartree
zpe.sumelectzpe: -2116.577408 hartree
zpe.sumelectthermal: -2116.554749 hartree
zpe.sumelectthermalent: -2116.553805 hartree
zpe.sumelectthermalfe: -2116.632969 hartree
dipole: -0.4294 0.5277 -1.1356
dipole: 1.3238
quadrupole: -171.8244 -163.2757 -130.7379
quadrupole: 15.6913 12.5062 14.5063
quadrupole: -16.5450 -7.9964 24.5414 15.6913 12.5062 14.5063
hfenergy: -2116.8546454 hartree
pointgroup: C01 [X(C12H16Cl2N3O3P1)]
dipole: 0.1151658 -0.5069622 -0.0314374 debye
polarizability: 308.7879224|-41.3117445|164.4635432|19.1045598|4.704293|173.1293645 unknown
InChI: InChI=1S/C12H16Cl2N3O3P/c1-20-12(18)9-2-3-10-11(8-9)16-21(19,15-10)17(6-4-13)7-5-14/h2-3,8,15-16H,4-7H2,1H3
charge 0 multiplicity 1
37 atoms
Cl -6.615969 0.334868 -1.845048
Cl -2.607078 -2.443298 3.235559
P  -1.631907 1.260147 -0.441578
O  -2.23045 2.463228 -1.303091
O  4.450847 -1.664796 -1.100242
O  5.46782 -0.782998 0.803266
N  -2.940934 0.227015 0.075709
N  -0.357443 0.220116 -1.063879
N  -0.580046 1.641455 0.931383
C  0.846263 0.256801 -0.319056
C  0.711585 1.085053 0.843498
C  -4.339226 0.607619 -0.237778
C  -2.687358 -1.0205 0.826279
C  2.053804 -0.395062 -0.598918
C  1.7951 1.259519 1.72759
C  -4.772161 0.012392 -1.587653
C  -2.809239 -0.790666 2.343267
C  3.145062 -0.220858 0.29832
C  3.009757 0.600226 1.447605
C  4.453988 -0.883445 0.066725
C  5.724679 -2.357035 -1.397625
H  -0.418221 -0.239994 -1.970182
H  -0.814421 2.363828 1.610687
H  -5.000608 0.240767 0.568585
H  -4.426407 1.706095 -0.28175
H  -3.412394 -1.79259 0.508009
H  -1.678919 -1.402401 0.587226
H  2.178252 -1.026641 -1.482392
H  1.697082 1.894833 2.613814
H  -4.259468 0.502847 -2.427794
H  -4.652093 -1.081093 -1.62713
H  -2.011419 -0.138257 2.725897
H  -3.801082 -0.413063 2.633726
H  3.872955 0.709606 2.111067
H  6.538918 -1.623889 -1.525495
H  5.535958 -2.906607 -2.33071
H  5.987572 -3.04542 -0.576692
