program: Gaussian 09
title: 000254321
version: EM64L-G09RevD.01
frameworkgroup: C1[X(C14H22N2O2)]
method: RPBEPBE
basis: SDD
operation: Freq
keyword: #p
keyword: freq=noraman
keyword: PBEPBE/SDD
title: #p freq=noraman PBEPBE/SDD
converged: NO YES NO NO
title: Mulliken charges:
elementType: O O N N C C C C C C C C C C C C C C H H H H H H H H H H H H H H H H H H H H H H
charge: -0.219452 -0.236657 -0.439385 -0.399032 -0.010452 -0.005641 0.308157 -0.504149 -0.502210 -0.473958 -0.472393 -0.470926 -0.467353 -0.409593 -0.407392 -0.381703 0.125705 0.157456 0.211014 0.194334 0.197342 0.230743 0.227922 0.196090 0.217385 0.233414 0.233738 0.217266 0.194388 0.211177 0.207521 0.193287 0.198156 0.190715 0.191206 0.198041 0.200956 0.188883 0.326586 0.348814
chargesum: 0.00000
title: Mulliken charges with hydrogens summed into heavy atoms:
elementType: O O N N C C C C C C C C C C C C C C
charge: -0.219452 -0.236657 -0.112799 -0.050217 0.200562 0.188693 0.308157 -0.076063 -0.078198 -0.023159 -0.021389 -0.065362 -0.066545 -0.020722 -0.018144 0.008135 0.125705 0.157456
polarizability: 2.06606159e+02 -5.86153793e+00 1.50417021e+02 8.64624299e-01 -2.99340370e+00 1.31779992e+02
1716.lowfreq: -6.3651 -4.5204 0.0003 0.0006 0.0009 17.5567 24.8976 31.4301 70.5218
frequency: 24.4899 31.3599 70.5195 92.1740 107.3955 158.5778 170.2549 180.4085 186.5790 210.5697 213.5839 299.0068 333.6907 344.0894 354.1722 388.5295 408.9535 417.0312 430.2425 457.9877 466.3455 480.1499 488.0044 576.9606 589.6254 606.5964 637.8893 645.3617 693.9817 733.2159 747.5800 776.5016 782.1000 789.0430 817.0643 850.0735 881.8034 890.6290 914.2825 928.5287 930.9783 958.4120 960.2306 965.9208 999.8258 1006.8120 1053.0768 1053.8956 1068.4081 1071.2996 1088.7171 1089.4734 1097.1354 1115.3527 1127.6179 1149.7897 1157.9123 1191.7802 1192.4867 1219.2430 1241.4555 1256.0110 1257.1867 1258.8578 1266.3492 1287.7195 1297.7694 1302.4871 1307.1079 1311.6873 1316.2318 1325.4767 1327.6256 1336.1715 1339.0900 1339.8059 1344.7987 1345.6449 1356.1868 1363.2000 1374.5511 1454.0050 1457.2692 1461.5546 1462.4295 1466.5965 1468.1692 1469.3032 1475.7448 1478.8832 1676.1698 1719.3267 2915.5702 2930.8870 2949.7520 2951.1645 2955.8550 2961.5190 2963.5864 2964.1679 2965.5073 2989.7897 2993.1801 3023.4695 3026.1946 3028.8173 3030.6075 3040.4455 3043.1641 3046.7557 3052.2015 3056.9526 3588.2060 3610.3963
redmass: 3.2739 4.9495 4.2943 3.2277 4.6212 6.8071 3.4074 3.3912 6.0059 1.8272 2.1857 2.1170 3.8245 2.3102 3.0944 2.1633 3.7281 3.0883 2.9500 1.2384 2.1794 1.8016 2.8650 2.4082 4.0433 8.9396 3.1437 1.2116 7.3267 6.6828 3.5388 1.4762 1.5155 2.1957 2.6291 1.9350 1.9490 1.4350 2.1515 1.4540 2.2798 2.8289 2.5466 2.7609 2.3177 2.5235 1.4249 1.5237 2.3982 1.4302 1.7862 1.9156 2.3825 2.3900 1.6256 2.0606 2.7715 1.9675 1.5680 2.1755 1.3471 1.3294 1.2684 1.1552 1.4252 1.4414 1.2685 2.3446 1.2958 2.3897 1.3359 1.3391 1.4541 1.4505 1.4475 1.6576 1.5873 1.5722 1.5673 1.6663 1.5015 1.0843 1.0880 1.0897 1.0902 1.0852 1.0852 1.0803 1.0957 1.0896 8.5319 9.4659 1.0799 1.0809 1.0672 1.0647 1.0670 1.0681 1.0622 1.0622 1.0633 1.0599 1.0610 1.0955 1.0961 1.1009 1.0968 1.1024 1.0921 1.0935 1.1031 1.1030 1.0802 1.0797
irintensity: 0.0447 0.4945 0.0113 0.1228 1.4027 1.4529 0.3854 0.5835 1.6629 0.0197 2.3705 0.3562 10.2374 1.2941 0.0820 3.1348 7.8480 3.2004 0.6177 59.4779 1.0509 0.1999 24.8477 5.7583 3.6968 11.9071 2.6362 124.2059 0.5023 60.8405 18.5007 0.1106 0.1371 1.8686 6.0401 3.8978 2.2165 11.5676 2.0999 12.4122 21.5042 11.2889 1.6097 8.9963 6.1289 20.9207 1.0606 1.1856 9.6534 0.2846 2.7845 1.0472 1.2883 0.0203 0.0875 7.4131 0.9228 20.8686 2.4440 50.7401 0.1056 16.3975 5.9905 5.6558 15.5699 18.1861 1.4610 159.2150 0.4013 58.4741 8.6302 0.2218 0.1754 0.4305 1.9609 12.2322 15.0473 14.0392 9.9175 4.8992 1.5039 8.8622 2.6247 5.6066 9.3902 0.8295 18.1299 17.4529 5.8622 6.6870 505.3590 474.8177 3.0583 5.5364 15.9875 14.6700 2.1016 99.1947 36.1210 51.3024 35.4421 20.2748 14.8298 71.3827 98.1702 2.1631 3.7342 143.4977 85.9129 0.9733 4.8534 47.9446 72.3611 30.8159
temp: 298.150 k
press: 1.00000 atm
elementType: 8 8 7 7 6 6 6 6 6 6 6 6 6 6 6 6 6 6 1 1 1 1 1 1 1 1 1 1 1 1 1 1 1 1 1 1 1 1 1 1
symmnumber: 1
zpe: 908604.3 jmol-1
zpe.correction: 0.346069 hartree
zpe.thermalcorrener: 0.362670 hartree
zpe.thermalcorrenthalpy: 0.363615 hartree
zpe.thermalcorrgfe: 0.301322 hartree
zpe.sumelectzpe: -805.302208 hartree
zpe.sumelectthermal: -805.285607 hartree
zpe.sumelectthermalent: -805.284663 hartree
zpe.sumelectthermalfe: -805.346955 hartree
dipole: 4.1690 -0.0709 0.0058
dipole: 4.1696
quadrupole: -122.6880 -123.5272 -107.7206
quadrupole: 5.0239 -0.9492 3.0023
quadrupole: -4.7094 -5.5486 10.2580 5.0239 -0.9492 3.0023
hfenergy: -805.6482773 hartree
pointgroup: C01 [X(C14H22N2O2)]
dipole: -1.6402424 -0.0228981 0.0125182 debye
polarizability: 206.6289286|5.6922542|150.4449551|-1.2122397|-2.8227826|131.7292881 unknown
InChI: InChI=1S/C14H22N2O2/c17-12-14(16-13(18)15-12)8-6-11(7-9-14)10-4-2-1-3-5-10/h10-11,15-16H,1-9H2
charge 0 multiplicity 1
40 atoms
O  3.505058 -2.274546 0.237882
O  4.446793 2.318785 -0.298236
N  2.402416 1.100432 -0.129598
N  4.315353 -0.057665 -0.026787
C  -1.083498 -0.421981 0.056652
C  -2.502543 0.232878 0.001525
C  1.965714 -0.306315 0.030457
C  -0.268077 -0.19503 -1.245626
C  -0.254579 0.084364 1.268386
C  1.144554 -0.818332 -1.185461
C  1.158091 -0.538018 1.337505
C  -3.30449 -0.205588 -1.255308
C  -3.332697 -0.078047 1.279923
C  -4.727584 0.402056 -1.298831
C  -4.75582 0.528586 1.233818
C  -5.529166 0.068042 -0.021482
C  3.330387 -1.039951 0.099355
C  3.778554 1.265749 -0.168962
H  -1.224975 -1.520535 0.176825
H  -2.363595 1.337804 -0.053722
H  -0.196015 0.896517 -1.444596
H  -0.795426 -0.631759 -2.112684
H  -0.775237 -0.14486 2.215367
H  -0.179111 1.192477 1.217447
H  1.699571 -0.604526 -2.118371
H  1.069232 -1.919039 -1.092264
H  1.084354 -1.632078 1.490174
H  1.720777 -0.122838 2.194719
H  -3.380169 -1.314446 -1.261541
H  -2.765555 0.083428 -2.176849
H  -2.812693 0.296994 2.181498
H  -3.410374 -1.181277 1.390386
H  -5.262715 0.038341 -2.197645
H  -4.648826 1.504972 -1.398585
H  -4.680216 1.636114 1.226881
H  -5.309834 0.253281 2.152525
H  -6.528099 0.544486 -0.055943
H  -5.696435 -1.027978 0.03136
H  1.772078 1.894858 -0.213203
H  5.320002 -0.234957 -0.021183
