program: Gaussian 09
title: 000254344
version: EM64L-G09RevD.01
frameworkgroup: C1[X(C17H14O5)]
method: RPBEPBE
basis: SDD
operation: Freq
keyword: #pfreq=noraman
keyword: PBEPBE/SDD
title: #p freq=noraman PBEPBE/SDD
converged: YES YES NO NO
title: Mulliken charges:
elementType: O O O O O C C C C C C C C C C C C C C C C C H H H H H H H H H H H H H H
charge: -0.267282 -0.271233 -0.270645 -0.353244 -0.207050 -0.021316 0.018852 0.203361 0.162532 0.112176 0.221637 0.220905 0.033701 -0.348160 -0.363665 -0.400695 -0.400470 -0.173063 -0.255680 -0.208846 -0.511895 -0.512694 0.283284 0.263524 0.260163 0.260080 0.235128 0.238963 0.238315 0.375764 0.239326 0.240028 0.238962 0.240216 0.239484 0.239535
chargesum: 0.00000
title: Mulliken charges with hydrogens summed into heavy atoms:
elementType: O O O O O C C C C C C C C C C C C C C C C C
charge: -0.267282 -0.271233 -0.270645 0.022520 -0.207050 -0.021316 0.018852 0.203361 0.162532 0.112176 0.221637 0.220905 0.033701 -0.064876 -0.100140 -0.140533 -0.140389 0.062065 -0.016717 0.029469 0.206421 0.206541
polarizability: 2.90458107e+02 -1.44346231e-02 1.60394277e+02 4.36494092e+00 -1.25149284e-01 1.72933467e+02
1716.lowfreq: -8.7536 -0.0010 -0.0007 0.0002 8.0691 8.6955 22.1219 34.2225 44.6495
frequency: 20.8678 34.1702 44.6475 64.9834 88.7680 94.0903 123.0963 133.0271 167.2179 179.8449 201.4781 219.9197 230.5805 232.9873 274.8186 284.1822 302.0411 310.9614 344.8024 366.8168 413.5998 441.6092 442.0640 455.2402 481.1999 486.4732 505.5676 520.3329 526.7780 531.7184 579.7013 604.9968 633.1191 636.8200 673.9990 700.4330 702.3562 727.0792 768.0571 800.1346 800.4285 815.9899 857.8149 861.4470 881.4221 881.9408 953.9617 968.8269 973.3337 976.0256 1002.6193 1024.4353 1031.2921 1056.9521 1082.1756 1102.5445 1108.0426 1108.2833 1132.2639 1152.1832 1156.6328 1163.1498 1167.9294 1202.0032 1220.4411 1225.6234 1251.0352 1272.0839 1283.9446 1344.8367 1390.8561 1401.7672 1411.9194 1420.0557 1445.0853 1453.3419 1456.9919 1458.4779 1459.9035 1461.5806 1479.2815 1480.4045 1560.1310 1570.2781 1570.6357 1595.5127 1605.1506 1618.3655 2989.1735 2989.9861 3093.7237 3094.1239 3117.9849 3118.4384 3140.7295 3146.0958 3152.1266 3164.3515 3175.6041 3175.6092 3185.1023 3493.9054
redmass: 8.2101 5.1218 3.8577 3.2460 3.8518 7.1763 4.7008 5.7057 6.1011 5.8050 2.6552 1.7841 1.2380 1.5152 5.7606 3.2858 7.0518 6.5919 7.7655 5.1060 8.3613 4.2015 5.7259 4.0601 6.5040 1.2009 4.9366 6.9370 6.4452 4.0098 7.7250 4.8485 5.2993 6.1889 7.0855 4.4826 7.1163 2.5969 1.6133 3.0642 1.8706 6.3374 6.6059 6.3316 1.4419 1.4518 8.8380 8.6332 1.3619 1.3204 1.3273 2.0131 4.5622 3.4766 2.0405 2.4097 1.2413 1.2445 2.0878 1.3597 1.2942 1.1828 1.2342 2.4770 2.4742 2.0978 3.4533 3.7598 1.7909 9.0107 3.5686 10.2520 1.6701 2.6524 2.2103 1.4828 1.3407 1.8662 1.1744 1.3002 1.0486 1.0563 8.1011 7.0768 8.8250 8.0628 8.2353 7.0529 1.0293 1.0294 1.1049 1.1049 1.1036 1.1037 1.0860 1.0879 1.0898 1.0953 1.0922 1.1007 1.0985 1.0647
irintensity: 1.4028 0.0636 0.9138 0.0092 12.0376 2.6045 0.5316 7.5717 1.0841 0.0147 0.4466 0.2888 0.0206 1.1967 4.7846 13.9698 0.0188 10.0158 4.6803 0.0874 0.9535 3.6426 2.4457 2.2423 3.4457 76.6089 0.7703 1.9542 0.0183 0.4894 4.8817 0.4492 10.4736 7.1825 9.9042 3.9156 6.1711 17.8159 83.9544 8.3970 75.6821 0.6780 21.7604 31.0127 2.7947 0.3214 19.7408 36.0596 1.8953 1.3042 0.2629 6.7463 123.4635 17.0119 7.7059 97.8293 2.5047 2.4939 264.3989 28.3897 19.3909 4.0805 2.9325 34.5606 3.6056 108.0437 13.0271 101.6170 62.5524 27.2389 28.9408 6.4564 124.1116 3.8476 54.2005 18.1666 61.7655 13.4078 0.6368 30.2083 42.0303 0.8378 95.2962 96.9252 83.4649 51.1688 231.3569 11.1879 29.6052 68.4366 1.7377 55.3430 35.4240 14.4771 3.5269 12.3371 3.3123 7.7664 3.1028 20.3804 7.6791 54.2477
temp: 298.150 k
press: 1.00000 atm
elementType: 8 8 8 8 8 6 6 6 6 6 6 6 6 6 6 6 6 6 6 6 6 6 1 1 1 1 1 1 1 1 1 1 1 1 1 1
symmnumber: 1
zpe: 707513.0 jmol-1
zpe.correction: 0.269477 hartree
zpe.thermalcorrener: 0.289059 hartree
zpe.thermalcorrenthalpy: 0.290003 hartree
zpe.thermalcorrgfe: 0.220756 hartree
zpe.sumelectzpe: -1030.713000 hartree
zpe.sumelectthermal: -1030.693418 hartree
zpe.sumelectthermalent: -1030.692474 hartree
zpe.sumelectthermalfe: -1030.761722 hartree
dipole: -0.5175 0.0346 -5.8292
dipole: 5.8523
quadrupole: -108.6250 -123.8271 -140.1755
quadrupole: -0.0666 11.9278 0.1389
quadrupole: 15.5842 0.3821 -15.9663 -0.0666 11.9278 0.1389
hfenergy: -1030.9824772 hartree
pointgroup: C01 [X(C17H14O5)]
dipole: -0.1061292 -0.1863765 2.2924531 debye
polarizability: 289.8750126|0.3105379|160.4843274|-9.3362961|-1.080391|173.4265114 unknown
InChI: InChI=1S/C17H14O5/c1-20-12-8-5-9-13(21-2)14(12)17-16(19)15(18)10-6-3-4-7-11(10)22-17/h3-9,19H,1-2H3
charge 0 multiplicity 1
36 atoms
O  -0.421965 -0.087664 1.17951
O  2.057298 2.488779 0.42158
O  2.051695 -2.535414 0.044602
O  0.614743 0.183396 -2.39033
O  -2.157829 0.216525 -2.633042
C  1.847683 -0.023633 0.247212
C  0.379369 -0.001649 0.019673
C  -2.439947 0.028302 -0.231594
C  -1.819765 -0.072982 1.042096
C  -0.171587 0.099267 -1.246891
C  2.598484 1.198456 0.373824
C  2.593858 -1.253206 0.189094
C  -1.636415 0.124004 -1.478862
C  -3.86148 0.036837 -0.286381
C  -2.571204 -0.164175 2.236025
C  4.013859 1.189574 0.379465
C  4.00971 -1.249437 0.196399
C  4.7083 -0.030516 0.277664
C  -4.623008 -0.053166 0.888549
C  -3.974481 -0.153868 2.152466
C  0.730237 2.765765 1.000363
C  0.713381 -2.891792 0.548665
H  -4.326197 0.116271 -1.274743
H  -2.04951 -0.240465 3.194638
H  4.532937 2.14734 0.468016
H  4.525559 -2.211389 0.14007
H  5.803323 -0.032862 0.282459
H  -5.716434 -0.046091 0.837404
H  -4.570302 -0.223992 3.068712
H  1.578293 0.160327 -2.141833
H  -0.069206 2.610681 0.255798
H  0.769327 3.829483 1.281334
H  0.544114 2.14205 1.891815
H  0.747812 -3.985718 0.667573
H  -0.071504 -2.625868 -0.179935
H  0.508854 -2.409371 1.520205
