program: Gaussian 09
title: 000254483
version: EM64L-G09RevD.01
frameworkgroup: C1[X(C21H24N2O5)]
method: RPBEPBE
basis: SDD
operation: Freq
keyword: #p
keyword: freq=noraman
keyword: PBEPBE/SDD
title: #p freq=noraman PBEPBE/SDD
converged: YES YES NO NO
title: Mulliken charges:
elementType: O O O O O N N C C C C C C C C C C C C C C C C C C C C C H H H H H H H H H H H H H H H H H H H H H H H H
charge: -0.257678 -0.264414 -0.235584 -0.216126 -0.175180 -0.307447 -0.482220 0.197413 0.386325 -0.503699 -0.480876 -0.431434 -0.437440 -0.501997 -0.470542 0.168497 -0.410382 -0.446216 0.113229 0.103420 0.056046 0.195628 0.173772 -0.355716 -0.352964 -0.212321 -0.210709 -0.497287 0.280085 0.222952 0.207499 0.267252 0.243707 0.202376 0.207901 0.223707 0.223329 0.264078 0.241918 0.229823 0.396258 0.216294 0.221982 0.209876 0.251589 0.271737 0.270890 0.238742 0.238823 0.245806 0.235049 0.244228
chargesum: 0.00000
title: Mulliken charges with hydrogens summed into heavy atoms:
elementType: O O O O O N N C C C C C C C C C C C C C C C C C C C C C
charge: -0.257678 -0.264414 -0.235584 -0.216126 -0.175180 -0.307447 -0.085962 0.197413 0.386325 -0.000662 -0.006124 0.014649 -0.005832 -0.014590 0.001200 0.168497 0.027894 0.015249 0.113229 0.103420 0.056046 0.195628 0.173772 -0.083979 -0.082074 0.026421 0.028114 0.227796
polarizability: 2.79652752e+02 -2.83840635e+01 2.61452497e+02 2.21196889e+01 2.05475027e+01 2.08922021e+02
1716.lowfreq: -6.3817 0.0005 0.0006 0.0008 4.7073 7.2373 17.0779 27.1854 40.5643
frequency: 16.3538 26.6740 40.4563 48.5635 59.7527 67.5541 80.5361 88.8797 98.2994 112.9681 123.1441 126.3929 128.4249 145.9746 149.0082 175.2607 194.9268 218.8407 227.9609 241.0920 259.3727 261.9496 293.6504 296.5862 317.8139 332.4920 349.4388 357.7344 400.6719 407.5869 432.5618 443.8417 452.6705 522.5295 525.4702 548.6250 555.8507 597.6841 634.9687 647.7864 653.2678 657.3402 690.5040 694.5255 704.9902 715.0133 742.7086 755.9998 780.2923 786.7893 790.9437 798.8261 811.0407 815.3785 833.2442 844.6135 854.6710 862.3570 884.5566 906.6542 909.2863 911.7374 926.7692 960.5258 969.1689 974.5348 983.0545 996.3397 1006.3782 1007.0551 1017.6842 1032.4310 1045.4801 1056.9049 1061.0769 1064.4829 1075.4626 1084.1605 1097.2677 1114.1029 1135.1882 1143.1750 1150.3881 1163.8898 1167.2885 1172.3019 1184.2014 1200.0599 1214.8011 1219.7261 1226.1453 1236.9565 1241.9924 1251.2151 1270.1819 1280.4972 1284.7402 1296.4760 1298.2600 1309.1145 1311.3698 1311.7845 1322.2353 1324.6632 1328.1618 1416.2199 1422.8691 1445.2540 1449.7363 1452.8916 1452.9524 1456.3883 1460.1893 1463.4028 1466.3894 1468.8027 1474.4062 1477.2235 1487.7710 1497.6186 1589.9282 1615.0119 1620.0323 1622.2036 1624.0392 1671.9643 3000.2734 3003.5657 3003.7423 3006.9022 3014.4818 3016.6855 3019.0301 3028.0838 3031.2798 3058.4399 3062.3215 3078.6971 3082.6965 3089.6137 3100.7877 3108.7362 3110.3885 3131.5949 3139.0536 3152.0004 3153.2745 3165.3164 3174.5568 3366.6003
redmass: 5.6289 5.1242 5.7960 5.6085 3.6623 2.9364 2.8698 3.0227 1.7798 1.8328 3.7581 6.1356 4.6162 3.9092 4.2824 7.2794 2.8987 4.8770 2.8625 2.8747 5.1902 5.9109 2.9912 3.2424 3.2950 4.4212 6.4075 5.8458 6.9824 3.3518 4.7555 4.1262 4.8951 2.6831 5.5212 2.2758 9.2009 3.1618 6.0329 3.1894 3.1747 4.7522 7.4019 6.0272 4.9232 3.3380 3.6468 2.4720 1.3374 3.2551 1.7513 1.7271 2.2254 1.9522 3.0762 2.5221 5.4450 2.3497 2.2705 1.3988 2.6617 2.4821 4.0302 2.3063 2.7202 1.4124 1.7162 3.0894 1.3594 1.8907 2.4285 2.2563 2.3620 2.1611 4.7785 1.4900 2.6393 2.5664 2.5087 1.2654 3.2187 3.2693 1.4550 1.3688 1.8416 2.0861 1.4879 2.2850 1.4966 1.6671 1.6088 1.4008 1.4834 1.3899 1.9113 1.5505 1.3440 3.8852 1.6155 1.3486 1.3757 1.3627 1.3119 1.4162 1.4848 6.8476 1.1877 1.0937 1.0934 2.4537 1.0507 2.7237 1.0840 1.0588 1.0844 1.0806 1.0936 1.1104 1.0989 1.7843 8.5252 8.0739 8.0169 9.2240 7.8435 12.6180 1.0629 1.0595 1.0664 1.0293 1.0596 1.0636 1.0614 1.0637 1.0683 1.0997 1.1031 1.1032 1.1025 1.1044 1.1050 1.0967 1.1048 1.0980 1.0865 1.1052 1.0907 1.0956 1.1003 1.0800
irintensity: 0.1679 0.8711 0.4408 1.1869 1.3677 0.9491 0.8507 1.9073 0.0367 0.6558 1.7030 7.0778 0.7641 2.7263 4.0114 1.4389 2.4480 0.4733 3.2166 6.1678 2.7320 1.7112 3.5984 8.5088 10.9300 7.0483 15.0754 3.5622 12.0650 2.0299 3.8239 1.5028 0.2326 4.3958 7.4650 9.4425 2.5539 21.6162 12.2355 7.7793 7.2746 1.4064 2.0638 15.1893 14.9817 48.1409 11.7979 17.2823 68.3198 2.6034 66.9735 41.6370 1.0552 3.6970 10.7770 10.8753 15.2957 1.5724 15.9308 0.0370 6.9288 2.9239 18.7378 9.6049 13.8458 2.1756 10.5874 5.0964 0.0451 0.6835 0.9468 50.3719 14.1353 30.5529 2.7588 5.5319 2.1163 4.4984 0.8582 0.7418 141.1424 136.4607 25.9777 3.9044 5.5492 1.1278 5.0169 4.1085 8.2801 3.5288 52.1394 4.2896 3.6045 19.0890 66.7521 16.4459 2.8107 299.8631 52.0914 6.6970 2.5163 1.3553 3.2671 4.5536 14.3494 14.1769 17.8900 8.0611 14.7186 10.8078 14.0632 0.0608 7.1998 9.1510 18.4768 9.7794 26.5252 26.9002 9.4319 377.8986 96.7520 159.6456 4.6015 249.8601 101.3539 58.9299 31.0988 34.7552 8.1097 36.2955 53.7438 59.4709 35.2304 17.5466 20.1706 16.8230 17.9071 12.0237 53.9075 11.6341 47.5728 14.6859 21.7210 5.7784 2.0706 13.7958 6.5370 5.1288 22.1906 101.3083
temp: 298.150 k
press: 1.00000 atm
elementType: 8 8 8 8 8 7 7 6 6 6 6 6 6 6 6 6 6 6 6 6 6 6 6 6 6 6 6 6 1 1 1 1 1 1 1 1 1 1 1 1 1 1 1 1 1 1 1 1 1 1 1 1
symmnumber: 1
zpe: 1098567.8 jmol-1
zpe.correction: 0.418422 hartree
zpe.thermalcorrener: 0.444275 hartree
zpe.thermalcorrenthalpy: 0.445219 hartree
zpe.thermalcorrgfe: 0.361153 hartree
zpe.sumelectzpe: -1298.242818 hartree
zpe.sumelectthermal: -1298.216966 hartree
zpe.sumelectthermalent: -1298.216022 hartree
zpe.sumelectthermalfe: -1298.300088 hartree
dipole: 0.5260 -4.0797 -1.2456
dipole: 4.2979
quadrupole: -132.8564 -151.9504 -171.4548
quadrupole: -3.6720 3.0586 -10.6307
quadrupole: 19.2308 0.1368 -19.3676 -3.6720 3.0586 -10.6307
hfenergy: -1298.6612407 hartree
pointgroup: C01 [X(C21H24N2O5)]
dipole: 0.1670677 -1.5690213 -0.6078261 debye
polarizability: 274.4365305|-32.1294613|260.6927478|24.1959559|21.8288098|214.8979917 unknown
InChI: InChI=1S/C21H24N2O5/c1-28-19(27)20(10-4-5-11-20)22-18(26)21(12-6-7-13-21)23-16(24)14-8-2-3-9-15(14)17(23)25/h2-3,8-9,22H,4-7,10-13H2,1H3
charge 0 multiplicity 1
52 atoms
O  -1.141232 1.862958 1.336223
O  -4.133716 -2.063292 -0.55269
O  -2.269554 -1.712369 -1.891535
O  1.029018 -0.861138 -1.833014
O  2.812597 1.368622 1.940528
N  1.717438 0.60633 -0.070231
N  -1.313824 0.244549 -0.326669
C  0.719808 1.700709 -0.304999
C  -2.631828 -0.277403 0.104629
C  1.156981 3.062173 0.307972
C  0.583027 2.065311 -1.820207
C  0.342666 4.131815 -0.476504
C  -0.13739 3.436083 -1.793116
C  -3.774157 0.813999 0.026721
C  -2.661523 -0.784587 1.603815
C  -0.666085 1.27287 0.315756
C  -4.695805 0.525247 1.232931
C  -3.700628 0.100689 2.341749
C  -2.95265 -1.410545 -0.883802
C  1.796477 -0.572795 -0.876369
C  2.669838 0.539512 1.01312
C  2.922213 -1.388801 -0.333475
C  3.43989 -0.728658 0.801946
C  3.439112 -2.617732 -0.770621
C  4.498547 -1.270665 1.545943
C  4.514466 -3.173522 -0.029979
C  5.035981 -2.510305 1.110704
C  -4.550979 -3.141426 -1.483924
H  0.968677 3.099504 1.389045
H  2.240942 3.192077 0.141176
H  1.605326 2.173066 -2.231669
H  0.060673 1.311159 -2.426179
H  -0.518755 4.470651 0.123301
H  0.968105 5.017404 -0.687055
H  0.092964 4.027546 -2.696406
H  -1.23299 3.286951 -1.773373
H  -4.296575 0.800244 -0.946062
H  -3.293715 1.798637 0.153421
H  -1.655548 -0.705975 2.04657
H  -2.970977 -1.843539 1.627831
H  -0.875699 -0.219645 -1.139172
H  -5.297365 1.4089 1.512483
H  -5.386674 -0.304793 0.9970
H  -4.191679 -0.437499 3.17208
H  -3.193315 0.992542 2.74772
H  3.022611 -3.121111 -1.648526
H  4.886957 -0.751797 2.427785
H  4.948876 -4.130058 -0.339653
H  5.864615 -2.965326 1.663858
H  -3.776941 -3.9255 -1.52761
H  -5.487787 -3.527977 -1.059561
H  -4.708113 -2.730988 -2.495304
