program: Gaussian 09
title: 000254335
version: EM64L-G09RevD.01
frameworkgroup: C1[X(C13H14N2O4S)]
method: RPBEPBE
basis: SDD
operation: Freq
keyword: #p
keyword: freq=noraman
keyword: PBEPBE/SDD
title: #p freq=noraman PBEPBE/SDD
converged: YES YES NO NO
title: Mulliken charges:
elementType: S O O O O N N C C C C C C C C C C C C C H H H H H H H H H H H H H H
charge: 0.257638 -0.296558 -0.231672 -0.239573 -0.235297 0.002428 -0.159154 -0.081038 -0.399560 0.215271 0.389852 0.235175 -0.345011 -0.378854 -0.220728 -0.196748 -0.261284 -0.529301 -0.250484 -0.660484 0.253557 0.295116 0.245668 0.235031 0.228876 0.227931 0.229170 0.276614 0.233407 0.223895 0.230337 0.220422 0.236603 0.248756
chargesum: 0.00000
title: Mulliken charges with hydrogens summed into heavy atoms:
elementType: S O O O O N N C C C C C C C C C C C C C
charge: 0.257638 -0.296558 -0.231672 -0.239573 -0.235297 0.002428 -0.159154 0.172518 -0.399560 0.215271 0.389852 0.235175 -0.049895 -0.133185 0.007202 0.032422 0.202623 0.204615 -0.020147 0.045296
polarizability: 2.29845121e+02 4.57757638e+00 2.10875077e+02 7.18081796e+00 -5.09012557e+00 1.20203068e+02
1716.lowfreq: -11.7805 -4.3180 0.0009 0.0018 0.0024 5.6680 10.0334 29.7004 37.9597
frequency: -1.5399 29.6330 37.8431 49.1524 65.5526 72.2585 86.3385 97.1098 99.4348 129.9727 146.5837 159.6364 201.6101 205.5489 221.9210 246.7431 270.6269 298.5012 306.7710 315.9432 335.2176 387.8793 409.5849 425.5842 482.2687 500.2352 511.0970 561.9082 599.7416 623.3762 641.4547 659.2184 691.9206 718.9524 738.1579 760.1746 765.4676 799.6434 816.8573 824.2909 835.0928 837.0358 904.1315 926.5937 933.4908 965.3071 985.2040 987.9332 1002.9409 1017.8297 1023.8661 1082.4530 1091.5213 1095.5800 1115.2727 1116.8466 1157.1767 1162.8682 1167.0321 1176.7596 1197.1178 1248.7173 1272.9517 1315.3411 1328.1599 1342.7786 1349.2922 1385.9897 1390.4847 1436.4810 1443.6251 1447.3786 1459.3635 1461.2849 1462.1481 1472.6591 1472.9263 1476.9727 1484.4634 1593.9994 1608.9107 1630.3557 2986.3464 2996.2244 3022.4420 3031.3939 3091.7182 3093.3498 3098.0151 3123.7039 3131.1289 3135.6347 3140.4456 3157.3269 3167.4614 3175.0887
redmass: 4.2517 5.1481 3.4211 4.1976 4.3959 4.4667 7.1268 5.2075 3.6968 1.4786 5.5237 2.1608 2.0850 6.6062 2.0691 4.9711 6.0950 4.5816 5.8497 7.5045 6.5981 6.8532 2.9415 3.8490 8.7916 3.3469 7.6639 9.3237 6.4549 6.5941 9.4497 9.6706 2.2234 9.6930 3.7461 1.5666 6.8398 3.1112 1.7350 3.4941 1.4033 4.7272 1.4322 7.3615 7.6348 1.3837 1.7885 2.6374 3.1273 5.7820 2.1558 1.5693 4.0593 2.3093 1.6573 3.3509 1.7075 1.3976 1.1891 1.3447 2.0388 6.1292 1.1232 1.3163 1.3797 1.1873 1.2847 7.9686 1.2264 1.1480 2.3833 4.4542 1.3302 1.0513 1.0593 1.6610 1.7131 2.4835 1.0806 6.3888 6.4060 10.1918 1.0326 1.0362 1.0852 1.0600 1.0976 1.1002 1.1027 1.1061 1.0850 1.1051 1.0894 1.0934 1.0962 1.1000
irintensity: 1.4116 0.0229 0.1784 0.0593 2.4377 0.8103 0.4023 1.4305 5.0554 1.8798 0.8354 5.7014 3.9902 2.3477 1.6003 5.2998 3.2465 11.1742 3.8639 44.6486 2.2124 8.8540 0.1099 2.1663 3.7021 12.1215 0.3134 1.6398 3.0266 8.8538 3.2490 7.1577 26.3386 12.2283 22.2484 87.0879 1.8914 26.9356 7.4351 19.4886 2.4279 72.8683 9.5549 161.8717 207.8362 0.1783 1.8652 3.1955 77.9221 137.0294 19.1930 7.6954 40.5084 14.6435 58.4780 156.9011 41.2797 8.8675 33.6500 68.6986 140.8873 97.1257 4.4783 0.9384 14.6629 0.9220 1.1980 7.1913 26.1969 5.1292 8.0006 192.6680 25.9934 6.3567 14.7506 58.3290 50.5764 60.7818 17.5909 29.2096 49.2696 159.7230 45.0814 18.3061 13.2301 24.3265 25.8165 31.3117 1.4760 28.5921 1.0915 11.3748 13.4238 28.6552 10.1123 7.9116
temp: 298.150 k
press: 1.00000 atm
elementType: 16 8 8 8 8 7 7 6 6 6 6 6 6 6 6 6 6 6 6 6 1 1 1 1 1 1 1 1 1 1 1 1 1 1
symmnumber: 1
zpe: 661001.5 jmol-1
zpe.correction: 0.251762 hartree
zpe.thermalcorrener: 0.271096 hartree
zpe.thermalcorrenthalpy: 0.272040 hartree
zpe.thermalcorrgfe: 0.202377 hartree
zpe.sumelectzpe: -1310.695458 hartree
zpe.sumelectthermal: -1310.676124 hartree
zpe.sumelectthermalent: -1310.675180 hartree
zpe.sumelectthermalfe: -1310.744843 hartree
dipole: 1.9092 2.3223 0.3131
dipole: 3.0227
quadrupole: -123.1215 -110.6970 -126.1760
quadrupole: -7.5451 -5.1037 -4.9176
quadrupole: -3.1234 9.3012 -6.1778 -7.5451 -5.1037 -4.9176
hfenergy: -1310.9472202 hartree
pointgroup: C01[X(C13H14N2O4S1)]
dipole: -0.4674638 -1.0030499 0.4353993 debye
polarizability: 224.3779894|4.5755145|209.4217527|-17.5557706|-21.4602787|127.1235246 unknown
InChI: InChI=1S/C13H14N2O4S/c1-3-18-12(16)10-11(20-15-14-10)13(17-2)19-9-7-5-4-6-8-9/h4-8,13H,3H2,1-2H3
charge 0 multiplicity 1
34 atoms
S  0.943849 3.224399 -1.82825
O  -0.732803 0.100535 0.029148
O  -1.064698 2.37512 0.845639
O  2.613446 -1.181329 -0.481485
O  1.850462 -0.215272 1.503139
N  2.98807 1.577999 -1.25458
N  2.909707 2.634591 -1.945414
C  -0.693186 1.531432 -0.268801
C  0.705469 1.812585 -0.799254
C  1.870188 1.057677 -0.589691
C  -2.00647 -0.517062 0.148386
C  2.076243 -0.15295 0.273646
C  -3.212804 0.194408 0.352463
C  -1.99568 -1.927878 0.060968
C  -4.422019 -0.53278 0.447419
C  -3.210113 -2.6364 0.168536
C  2.998482 -2.425955 0.265491
C  -0.152397 2.347413 2.015347
C  -4.430157 -1.942641 0.356579
C  4.396093 -2.278207 0.871005
H  -1.457383 1.77203 -1.031844
H  -3.207318 1.280698 0.476456
H  -1.042682 -2.442151 -0.097671
H  2.235756 -2.616266 1.040896
H  2.960626 -3.205211 -0.51159
H  -5.359388 0.011393 0.607782
H  -3.204202 -3.729716 0.099056
H  0.129616 1.314035 2.275016
H  -0.727259 2.81535 2.827963
H  0.75814 2.939996 1.808731
H  -5.371953 -2.495349 0.437265
H  4.702017 -3.235392 1.332371
H  5.134993 -2.016671 0.094647
H  4.407458 -1.500829 1.652836
