program: Gaussian 09
title: 000254320
version: EM64L-G09RevD.01
frameworkgroup: C1[X(C16H14N4)]
method: RPBEPBE
basis: SDD
operation: Freq
keyword: #pfreq=noraman
keyword: PBEPBE/SDD
title: #p freq=noraman PBEPBE/SDD
converged: YES YES NO NO
title: Mulliken charges:
elementType: N N N N C C C C C C C C C C C C C C C C H H H H H H H H H H H H H H
charge: -0.452672 -0.470308 -0.203967 -0.075946 -0.524979 -0.476458 0.273370 0.124558 0.248344 0.281211 0.081126 0.000275 -0.359847 -0.379384 -0.356150 -0.350784 -0.212689 -0.217746 -0.219253 -0.238792 0.258997 0.223585 0.230053 0.253631 0.314587 0.395862 0.237021 0.229808 0.248278 0.242249 0.229104 0.217363 0.230154 0.219400
chargesum: 0.00000
title: Mulliken charges with hydrogens summed into heavy atoms:
elementType: N N N N C C C C C C C C C C C C C C C C
charge: -0.138085 -0.074446 -0.203967 -0.075946 -0.042396 0.007226 0.273370 0.124558 0.248344 0.281211 0.081126 0.000275 -0.122826 -0.149577 -0.107872 -0.108536 0.016415 -0.000383 0.010901 -0.019393
polarizability: 2.86657058e+02 -4.79178648e-01 2.20474947e+02 5.58279286e+00 2.85169902e+00 9.04848313e+01
1716.lowfreq: -10.5010 -3.9059 -0.0006 -0.0005 -0.0003 6.6660 20.7754 49.2414 62.1313
frequency: 20.6848 49.2363 62.1297 82.3910 111.3764 154.8888 193.3853 234.1419 252.9686 264.9350 292.9752 334.7272 392.9166 431.1347 435.7383 451.4743 489.8673 511.8602 526.8364 579.4869 585.1326 606.9620 612.7121 619.5634 643.5387 647.5216 677.1268 714.5726 752.7965 755.5669 768.9623 772.8690 804.2990 813.6542 855.3934 858.1015 869.1783 884.2814 913.9830 931.8419 932.2235 938.9664 970.3087 975.6200 980.3487 994.7389 1005.4537 1011.1045 1015.4912 1037.4257 1107.8446 1113.3882 1156.0931 1162.7408 1166.6379 1187.5018 1205.2198 1211.1666 1230.2859 1262.5300 1267.4678 1276.7550 1288.7366 1315.3628 1326.8155 1342.0270 1383.8263 1389.6658 1415.4310 1423.6959 1441.2562 1445.2248 1453.1388 1459.7370 1476.0797 1477.1892 1517.2535 1538.9256 1590.6112 1598.5488 1632.6691 1637.1079 2983.6911 2992.2725 3038.8331 3077.9265 3078.4304 3124.3087 3135.4086 3138.5952 3146.7137 3153.6609 3160.9438 3166.6504 3173.8842 3595.5913
redmass: 4.7394 4.8148 4.9790 5.8847 4.1405 4.6930 4.5594 3.2797 4.6106 5.4432 3.2320 3.3761 4.1379 2.9849 3.1894 3.8874 5.0835 5.5718 3.0986 3.4301 3.7438 1.2441 6.4514 6.2217 5.0756 4.4084 4.1191 4.2049 1.3421 1.3990 3.4685 3.7713 4.4997 4.0688 1.5414 1.4862 4.3927 5.0170 3.1994 1.9388 1.9706 1.3853 1.3010 3.2632 1.3212 2.7703 1.6310 2.1943 1.5034 3.3570 1.6281 1.6157 1.1464 1.1457 1.2249 1.3588 2.7717 2.6429 1.4086 2.8233 2.1294 1.8577 1.7053 1.5377 1.8711 2.2880 2.6858 2.9054 2.9488 2.2794 2.9015 3.9261 1.1071 1.2587 3.5305 3.4866 4.2749 3.0927 6.6353 6.8550 7.3072 6.9094 1.0617 1.0651 1.1000 1.0959 1.0958 1.0849 1.0857 1.0899 1.0904 1.0958 1.0957 1.0993 1.0999 1.0814
irintensity: 0.4286 2.5901 3.6573 0.8660 2.2378 6.0181 0.5740 3.3373 1.5068 5.7422 1.2768 0.7188 7.9536 2.3476 9.4328 16.4993 1.2194 3.5275 1.4183 2.1225 0.8069 77.8690 4.6612 1.4443 8.9607 7.5731 3.2330 20.2257 49.8012 144.9031 8.7594 0.9910 12.0060 0.6708 0.3059 0.0192 2.9417 20.8654 2.1335 3.6085 4.2688 2.2273 0.5594 11.7763 0.0063 3.8769 45.0929 8.9242 51.6930 5.6187 2.5148 4.6998 1.0843 3.2969 9.7446 36.9953 39.2134 1.5388 9.3506 25.5230 77.5860 6.0173 12.5158 0.8099 18.7181 182.9261 22.9720 33.6942 5.3758 1.0965 49.5998 33.9777 6.1677 9.6973 3.6758 0.2239 34.1760 160.0006 7.0065 2.1154 19.9458 16.6006 25.7514 19.4591 24.2701 710.8476 952.0124 0.8711 0.1276 20.7331 9.3528 32.0913 19.3237 18.8399 14.7675 51.5654
temp: 298.150 k
press: 1.00000 atm
elementType: 7 7 7 7 6 6 6 6 6 6 6 6 6 6 6 6 6 6 6 6 1 1 1 1 1 1 1 1 1 1 1 1 1 1
symmnumber: 1
zpe: 707535.7 jmol-1
zpe.correction: 0.269486 hartree
zpe.thermalcorrener: 0.284488 hartree
zpe.thermalcorrenthalpy: 0.285432 hartree
zpe.thermalcorrgfe: 0.225865 hartree
zpe.sumelectzpe: -835.772755 hartree
zpe.sumelectthermal: -835.757754 hartree
zpe.sumelectthermalent: -835.756810 hartree
zpe.sumelectthermalfe: -835.816376 hartree
dipole: 7.3721 -1.3844 -1.0163
dipole: 7.5695
quadrupole: -109.1203 -100.4040 -121.9893
quadrupole: -13.9416 -0.7216 3.6838
quadrupole: 1.3842 10.1005 -11.4847 -13.9416 -0.7216 3.6838
hfenergy: -836.0422414 hartree
pointgroup: C01 [X(C16H14N4)]
dipole: 2.8496494 -0.7147391 -0.4873993 debye
polarizability: 284.8417354|-6.1639479|195.4815558|-18.2774644|-50.9817911|117.293545 unknown
InChI: InChI=1S/C16H14N4/c1-2-6-12-11(5-1)17-15(18-12)9-10-16-19-13-7-3-4-8-14(13)20-16/h1-8,17,19H,9-10H2
charge 0 multiplicity 1
34 atoms
N  2.870204 -1.722362 -0.020568
N  -1.437325 0.012914 0.404472
N  1.276399 -0.11266 -0.092549
N  -2.929629 -1.367007 1.461481
C  0.527964 -2.436564 0.666701
C  -0.483755 -1.932473 1.741569
C  1.523732 -1.407591 0.194033
C  -1.62787 -1.113058 1.207543
C  3.528114 -0.566487 -0.474289
C  -2.701653 0.530948 0.109275
C  2.507714 0.442084 -0.510774
C  -3.630935 -0.341713 0.783486
C  4.863752 -0.304724 -0.839701
C  -3.130819 1.638042 -0.653697
C  2.823608 1.755167 -0.924359
C  -5.020852 -0.098733 0.694638
C  5.160837 1.012537 -1.250944
C  -4.522546 1.861816 -0.729444
C  4.157854 2.025044 -1.292348
C  -5.453183 1.007821 -0.065748
H  -0.039842 -2.828339 -0.200165
H  1.088275 -3.293177 1.088505
H  0.068126 -1.366093 2.517322
H  -0.940253 -2.806015 2.236992
H  3.291741 -2.636933 0.132201
H  -0.478153 0.298256 0.092337
H  5.64038 -1.075832 -0.810651
H  -2.423289 2.298464 -1.166034
H  2.053338 2.53149 -0.954548
H  -5.730225 -0.756933 1.206015
H  6.185663 1.263202 -1.54508
H  -4.898402 2.711475 -1.310944
H  4.433476 3.033792 -1.617608
H  -6.524943 1.219744 -0.150821
