program: Gaussian 09
title: 000254318
version: EM64L-G09RevD.01
frameworkgroup: C1[X(C13H13N5O2S)]
method: RPBEPBE
basis: SDD
operation: Freq
keyword: #p
keyword: freq=noraman
keyword: PBEPBE/SDD
title: #p freq=noraman PBEPBE/SDD
converged: NO YES NO NO
title: Mulliken charges:
elementType: S O O N N N N N C C C C C C C C C C C C C H H H H H H H H H H H H H
charge: 0.261904 -0.266054 -0.266212 -0.165517 -0.218284 -0.366218 -0.040197 0.000941 0.104269 0.109078 0.137217 0.214064 -0.173637 -0.614159 -0.597605 -0.780374 0.487179 -0.318654 -0.318639 -0.323422 -0.323421 0.344737 0.244592 0.275514 0.244599 0.268866 0.251012 0.251011 0.302037 0.302018 0.241594 0.241597 0.245080 0.245081
chargesum: 0.00000
title: Mulliken charges with hydrogens summed into heavy atoms:
elementType: S O O N N N N N C C C C C C C C C C C C C
charge: 0.261904 -0.266054 -0.266212 -0.165517 -0.218284 -0.021481 -0.040197 0.000941 0.104269 0.109078 0.137217 0.214064 -0.173637 0.150546 0.173284 -0.176319 0.487179 -0.077060 -0.077042 -0.078341 -0.078340
polarizability: 3.35026928e+02 1.66846279e+00 1.70451438e+02 -6.38530617e-03 7.79040195e-04 1.28771032e+02
1716.lowfreq: -4.4810 0.0010 0.0013 0.0019 5.1727 6.0631 10.0380 20.8074 35.6857
frequency: 7.6403 20.7997 35.6645 39.5436 72.3276 83.0851 99.3254 105.2050 114.5939 121.3083 160.6982 182.8653 214.0405 235.2493 290.5067 305.6076 321.9367 337.9766 357.5355 364.3979 365.7795 376.4116 400.2934 475.0246 486.2726 492.9012 553.5778 586.3138 627.5794 636.7282 652.1526 662.2301 678.2537 679.4373 703.8114 739.7085 753.5532 765.4720 809.6357 843.0379 883.9007 892.2839 925.7966 935.6443 960.4908 968.1477 968.6781 977.2640 1038.2074 1062.3760 1077.7124 1101.2920 1122.4933 1129.7799 1131.7713 1167.3848 1192.0479 1216.9425 1227.5857 1228.8332 1256.4617 1261.3384 1287.8697 1307.2178 1327.9018 1334.6333 1371.3397 1391.7317 1404.1130 1418.4435 1429.5143 1448.9723 1466.8850 1472.0398 1473.9392 1478.5811 1479.9527 1511.2533 1559.4245 1578.8092 1586.9632 1616.6208 1657.4187 3006.0499 3012.2740 3057.4378 3095.0791 3104.4754 3132.2816 3133.3262 3136.8660 3138.5933 3138.6617 3153.1030 3159.2936 3587.7256
redmass: 5.6833 3.8435 4.4431 7.5000 4.3989 1.0980 6.9949 1.3129 3.5437 3.5755 7.3836 4.6966 9.2215 6.4179 3.3480 5.9765 2.3644 4.1602 7.1925 7.7789 2.4712 7.0243 7.5396 8.4315 7.9790 5.2559 6.5090 6.7568 11.6262 1.3330 4.9634 6.8650 7.2874 4.5090 11.2117 11.4071 2.9618 4.9062 3.1703 1.8403 1.2795 1.4770 4.5795 6.0517 6.6875 1.6377 2.7167 1.4981 3.2301 2.2130 1.5320 4.0888 1.0748 1.3009 1.3006 1.8838 3.3304 1.4177 2.3453 1.9744 1.5501 5.3690 6.9051 8.2079 11.4062 1.3095 4.9778 3.0206 1.9796 1.3130 1.2820 1.1146 2.0217 1.0430 1.2140 1.0672 1.0426 3.2206 6.9838 8.2930 5.6565 10.5341 10.4533 1.0337 1.0327 1.0579 1.1026 1.1022 1.0874 1.0894 1.1084 1.1013 1.1021 1.0965 1.0996 1.0821
irintensity: 1.1610 0.6102 1.3606 1.0123 0.1611 0.0016 0.2438 1.1984 0.1662 3.3329 5.2075 17.2678 1.9674 3.3573 2.1967 0.0516 0.1127 10.7420 0.9359 15.1851 0.0000 15.5877 13.9702 10.6728 13.7883 17.6281 26.9755 8.7468 2.5031 89.7189 29.3228 0.3722 12.9963 22.8252 5.1818 13.0209 6.5824 0.5607 4.6823 35.4671 0.2257 1.4338 3.7000 12.3997 1.2758 9.1745 30.4100 0.0000 39.6152 6.5163 0.8495 33.4895 0.0012 0.3316 0.0845 19.9919 66.0208 0.0043 2.0888 2.3589 33.4073 30.9773 38.0196 0.0830 98.6019 1.4528 3.4391 468.9647 21.4831 166.0176 79.5205 23.7386 4.9567 18.3118 2.4873 5.4434 18.0561 147.6897 12.0292 16.7508 46.6611 546.3750 562.0425 33.3948 30.4813 4.2876 18.5417 16.9440 7.8559 12.6680 0.3059 0.5350 0.6644 40.4482 0.5709 94.5656
temp: 298.150 k
press: 1.00000 atm
elementType: 16 8 8 7 7 7 7 7 6 6 6 6 6 6 6 6 6 6 6 6 6 1 1 1 1 1 1 1 1 1 1 1 1 1
symmnumber: 1
zpe: 663590.7 jmol-1
zpe.correction: 0.252748 hartree
zpe.thermalcorrener: 0.272289 hartree
zpe.thermalcorrenthalpy: 0.273233 hartree
zpe.thermalcorrgfe: 0.200578 hartree
zpe.sumelectzpe: -1323.977231 hartree
zpe.sumelectthermal: -1323.957690 hartree
zpe.sumelectthermalent: -1323.956746 hartree
zpe.sumelectthermalfe: -1324.029401 hartree
dipole: 1.8583 0.8545 -0.0006
dipole: 2.0454
quadrupole: -166.9302 -135.1000 -121.2069
quadrupole: 2.3234 -0.0058 0.0005
quadrupole: -25.8511 5.9790 19.8721 2.3234 -0.0058 0.0005
hfenergy: -1324.2299789 hartree
pointgroup: C01 [X(C13H13N5O2S1)]
dipole: -0.7316548 0.3350298 0.0000613 debye
polarizability: 335.0318091|-1.4072558|170.4465479|0.0050463|-0.0188493|128.77104 unknown
InChI: InChI=1S/C13H13N5O2S/c1-17-10-9(11(19)18(2)13(17)20)15-12(16-10)21-7-8-3-5-14-6-4-8/h3-6,15H,7H2,1-2H3
charge 0 multiplicity 1
34 atoms
S  -1.781731 -1.310367 0.001156
O  3.959375 -2.62972 0.001547
O  4.973955 1.985827 -0.000242
N  2.705467 1.38173 -0.000063
N  4.448445 -0.29919 0.000534
N  0.986161 -1.72804 0.001303
N  0.395291 0.475436 0.000377
N  -6.915645 0.054688 -0.000514
C  2.181296 -0.992155 0.00089
C  1.78161 0.35032 0.000377
C  3.549436 -1.427525 0.000994
C  4.092829 1.079123 -0.000077
C  -0.05225 -0.810358 0.000913
C  2.266688 2.790259 -0.000598
C  5.902921 -0.579759 0.000711
C  -2.562236 0.445366 0.000455
C  -4.063308 0.304543 0.000126
C  -4.795434 0.238322 1.212563
C  -4.794801 0.237311 -1.212639
C  -6.202427 0.116842 1.164032
C  -6.201818 0.115873 -1.164741
H  0.92785 -2.746307 0.001755
H  1.659808 2.998237 -0.897864
H  3.169528 3.417915 0.000049
H  1.6583 2.998358 0.895605
H  6.023712 -1.672857 0.001114
H  6.373369 -0.137061 0.893777
H  6.37345 -0.137691 -0.892622
H  -2.175277 0.950509 -0.896504
H  -2.175727 0.951047 0.897305
H  -4.281506 0.282863 2.178973
H  -4.280365 0.281037 -2.178816
H  -6.792276 0.067379 2.086135
H  -6.791186 0.065647 -2.087109
