program: Gaussian 09
title: 000254311
version: EM64L-G09RevD.01
frameworkgroup: C1[X(C9H10ClNO3)]
method: RPBEPBE
basis: SDD
operation: Freq
keyword: #p
keyword: freq=noraman
keyword: PBEPBE/SDD
title: #p freq=noraman PBEPBE/SDD
converged: YES YES NO NO
title: Mulliken charges:
elementType: Cl O O O N C C C C C C C C C H H H H H H H H H H
charge: -0.062030 -0.413825 -0.432200 -0.345379 -0.392508 0.554718 -0.395062 -0.567123 -0.387461 0.097656 0.196219 -0.329096 -0.551065 0.162507 0.260808 0.228684 0.310701 0.249901 0.223457 0.265593 0.287570 0.264547 0.386485 0.386901
chargesum: 0.00000
title: Mulliken charges with hydrogens summed into heavy atoms:
elementType: Cl O O O N C C C C C C C C C
charge: -0.062030 -0.027339 -0.045299 -0.345379 -0.081807 0.554718 0.094430 -0.317222 -0.164004 0.097656 0.196219 -0.063503 0.001052 0.162507
polarizability: 2.14100715e+02 3.97158059e+00 1.25017266e+02 2.08378611e+01 -2.36034446e+00 6.96709864e+01
1716.lowfreq: -4.6030 -0.0013 0.0011 0.0020 6.3825 8.2582 26.2141 38.5563 80.8501
frequency: 26.0540 38.4714 80.8421 109.0075 120.7741 159.2611 210.5371 235.9339 270.4241 295.7161 335.1416 384.5427 436.0356 444.2391 470.1750 517.3102 538.2090 559.0929 563.0833 592.4803 627.1737 631.8616 677.0859 704.5670 732.6852 742.4035 802.4298 848.7688 854.2599 861.7723 940.4027 949.0871 963.9735 1013.5705 1019.8500 1103.5666 1140.8941 1156.5237 1186.1976 1214.2051 1234.9884 1236.3417 1299.1037 1313.5024 1345.1669 1363.1664 1376.3567 1410.1966 1442.2655 1463.9940 1467.1459 1490.9134 1513.4883 1575.2927 1594.4548 1664.2419 2994.7215 2999.4755 3053.7908 3065.8537 3144.3146 3151.9060 3153.3503 3174.2852 3535.9471 3561.9436
redmass: 10.4957 7.3827 6.1665 4.2828 6.1516 6.4159 5.0007 5.8051 4.8078 3.6279 6.7063 3.4486 3.1437 2.5895 3.0099 1.7063 4.4718 1.2296 4.2664 4.1853 4.1606 5.1897 3.0567 4.1936 5.6645 3.1488 1.6281 1.6129 1.9877 1.2357 2.5662 2.4385 1.3469 2.5809 2.4488 2.4263 1.7212 1.2069 1.5886 1.7837 1.2512 1.7184 1.1921 1.8306 2.2177 1.6996 2.0627 4.2959 1.0984 1.6569 1.5185 2.0976 3.4923 3.4794 4.8044 4.9768 1.0695 1.0624 1.0651 1.0918 1.1111 1.0876 1.0914 1.0969 1.0641 1.0767
irintensity: 0.4007 1.1330 2.0616 1.5801 1.0994 4.4103 2.0945 0.9802 0.8190 2.3603 8.6257 11.1966 6.0280 49.3513 7.3987 120.1892 22.1256 99.0680 9.2831 10.6571 41.7375 17.6339 40.0900 7.3510 3.7700 0.2697 27.1263 158.8664 46.5759 22.9657 36.6141 8.7552 1.2882 115.8376 159.5011 92.0963 156.8672 1.7466 61.8445 111.0514 77.8499 25.1492 38.3308 114.4889 94.3821 117.1076 35.5252 116.7326 14.4741 148.0647 113.1682 120.2589 166.7867 149.4481 23.1650 711.2518 281.5457 34.9559 15.0632 14.6202 23.8568 4.9168 5.6296 10.4195 76.8720 52.2157
temp: 298.150 k
press: 1.00000 atm
elementType: 17 8 8 8 7 6 6 6 6 6 6 6 6 6 1 1 1 1 1 1 1 1 1 1
symmnumber: 1
zpe: 473630.4 jmol-1
zpe.correction: 0.180396 hartree
zpe.thermalcorrener: 0.193566 hartree
zpe.thermalcorrenthalpy: 0.194510 hartree
zpe.thermalcorrgfe: 0.138936 hartree
zpe.sumelectzpe: -1088.431517 hartree
zpe.sumelectthermal: -1088.418347 hartree
zpe.sumelectthermalent: -1088.417403 hartree
zpe.sumelectthermalfe: -1088.472977 hartree
dipole: 2.6532 -3.6263 1.4777
dipole: 4.7300
quadrupole: -87.9344 -86.2345 -91.3264
quadrupole: 4.0113 9.0562 1.7558
quadrupole: 0.5640 2.2639 -2.8280 4.0113 9.0562 1.7558
hfenergy: -1088.6119131 hartree
pointgroup: C01 [X(C9H10Cl1N1O3)]
dipole: 1.0991369 -1.4503803 0.3890591 debye
dipolederiv: -0.327462 -0.096583 0.1133271 -0.1775745 -0.3502825 0.1586331 0.1403462 0.0753761 -0.2994866 -0.8513752 0.4176156 0.0004362 0.4481371 -0.9019197 -0.0082791 -0.0201719 0.0060034 -0.3999019 -0.6771536 -0.4190529 -0.0791462 -0.8753987 -1.0976433 -0.2059919 -0.1513482 -0.1541724 -0.45885 -1.3751797 0.2104351 -0.110668 0.4505976 -0.8275377 0.0025015 -0.1104796 -0.0215623 -0.3866449 -1.8701666 0.1005178 -0.0656931 -0.102767 -0.1987739 -0.0840677 -0.436215 -0.0423821 -0.6051233 1.9600636 -0.0194714 0.1824231 0.4382118 0.3874714 0.076217 0.3739458 0.0261344 0.2012379 0.7068296 -0.1678307 -0.0565879 -0.7120856 0.1899711 0.0720564 0.0007062 0.0376482 0.2538984 -0.9750901 0.2845673 -0.0245297 0.3714205 -0.0884409 0.0629472 -0.0593512 0.0640182 -0.2560375 -0.7478614 -0.1165287 -0.0687995 -0.635799 -0.18458 -0.0464465 -0.1182865 -0.0102397 -0.2788067 -1.5287124 -0.2042132 -0.2118132 0.0535861 -0.4224205 -0.0320654 -0.2306611 -0.0744263 -0.1305319 1.2075725 -0.4633802 0.0799273 -0.0878808 0.8301784 0.0741388 0.1706809 0.0114268 0.1493863 0.8747045 0.0059428 0.1251213 -0.3259433 0.075164 -0.0357459 0.1099 0.019092 -0.0442317 0.2582238 0.1757323 -0.1239095 0.3983012 0.4275182 -0.1920897 -0.1333286 -0.2285053 0.2034214 2.5221692 0.2292855 0.3433232 0.3793273 1.3743178 0.1920138 0.4226221 0.1790997 0.3256595 -0.1192914 0.007129 -0.0835457 -0.0067347 0.0825947 -0.0919541 -0.0620984 -0.0382593 0.0221892 0.0618589 -0.0905122 0.0978434 0.0823132 -0.0653038 0.0519548 0.093299 0.064446 0.029803 0.1341088 0.0226597 -0.0192032 0.1252732 0.1104074 0.0136205 0.0219851 0.054162 0.353166 0.0391868 -0.0616109 -0.0318012 -0.0577534 -0.0246838 -0.0342246 -0.0341019 -0.0322953 0.1710673 -0.016627 0.1064679 -0.0182334 0.1235226 -0.0179782 -0.0208866 -0.0169007 -0.0074523 0.1611816 0.1040377 -0.0408304 -0.0117416 -0.02773 -0.0095524 -0.0229866 -0.0129879 -0.0278873 0.1452529 0.0051058 -0.0869566 -0.0746969 -0.1008511 0.0102079 0.0175585 -0.0537712 0.026427 0.0014118 -0.0927602 0.0649933 0.0385043 0.0880209 -0.0852965 0.0256322 0.0981609 0.0474042 0.0733812 0.4780979 0.0611918 0.0202956 -0.0339716 0.4552195 0.0086949 0.0129213 0.0209584 0.3708796 0.2297206 0.080432 -0.0208325 0.1857783 0.3313628 0.0187694 -0.0048652 0.0049861 0.3976781 unknown
polarizability: 216.0802788|4.0759669|125.1366296|11.6647246|2.4896559|67.5720589 unknown
InChI: InChI=1S/C9H10ClNO3/c10-3-4-11-6-1-2-7(9(13)14)8(12)5-6/h1-2,5,11-13H,3-4H2
charge 0 multiplicity 1
24 atoms
Cl 4.877653 0.659491 -1.543852
O  -2.001484 2.187945 0.083347
O  -3.55115 -1.706976 -0.646805
O  -3.961413 0.563931 -0.433304
N  2.432414 0.396819 0.616488
C  1.086296 0.165763 0.344624
C  3.492319 -0.606206 0.549522
C  0.190506 1.269524 0.331729
C  0.575458 -1.156035 0.098172
C  -1.697769 -0.246492 -0.159141
C  -1.180157 1.080415 0.08458
C  -0.787427 -1.340264 -0.143688
C  4.015716 -0.885112 -0.868896
C  -3.117866 -0.402795 -0.412014
H  4.333301 -0.271877 1.182872
H  3.133101 -1.560086 0.981849
H  2.734565 1.370814 0.656289
H  0.54656 2.288285 0.516335
H  1.240842 -2.023472 0.097108
H  -1.182132 -2.34327 -0.33204
H  3.208132 -1.104907 -1.582232
H  4.779925 -1.677524 -0.878309
H  -2.955171 1.875201 -0.112843
H  -4.53222 -1.688772 -0.807587
