program: Gaussian 09
title: 000254313
version: EM64L-G09RevD.01
frameworkgroup: C1[X(C13H15NO4)]
method: RPBEPBE
basis: SDD
operation: Freq
keyword: #p
keyword: freq=noraman
keyword: PBEPBE/SDD
title: #p freq=noraman PBEPBE/SDD
converged: YES YES NO NO
title: Mulliken charges:
elementType: O O O O N C C C C C C C C C C C C C H H H H H H H H H H H H H H H
charge: -0.290528 -0.244630 -0.255426 -0.170317 -0.232110 0.463058 -0.497034 -0.318956 -0.357746 0.237143 -0.361791 -0.356726 0.203293 0.181142 -0.790387 -0.058337 -0.220111 -0.674606 0.291410 0.283765 0.288643 0.239291 0.272495 0.272090 0.247902 0.237673 0.276195 0.201900 0.229654 0.230671 0.213628 0.229771 0.228980
chargesum: 0.00000
title: Mulliken charges with hydrogens summed into heavy atoms:
elementType: O O O O N C C C C C C C C C C C C C
charge: -0.290528 -0.244630 -0.255426 -0.170317 -0.232110 0.463058 0.078141 -0.030313 -0.118455 0.237143 -0.089295 -0.084636 0.203293 0.181142 -0.028617 0.143563 0.240214 -0.002227
polarizability: 2.58962706e+02 -1.38262932e+00 1.66645909e+02 -1.06405729e+00 1.00391249e+00 9.15732890e+01
1716.lowfreq: -3.0398 -0.0007 -0.0006 -0.0003 6.8263 7.4335 19.1906 28.3536 45.4621
frequency: 19.0997 28.2874 45.4450 53.4481 70.9377 76.7986 79.9827 109.0799 127.2662 137.9461 178.6691 192.1989 226.9711 242.7498 254.9029 304.9560 322.2008 347.4723 392.6329 400.1402 406.4583 421.9304 441.0839 486.6328 511.8981 568.1444 582.4831 630.9310 661.2715 676.2442 693.9418 739.1421 759.4671 798.2793 799.6017 832.7683 846.7720 852.9394 877.2051 972.6076 985.6497 991.0139 1000.6711 1005.0524 1023.2882 1027.6481 1059.6065 1066.8632 1112.5297 1119.1641 1136.6826 1137.5731 1189.9584 1198.4738 1241.4493 1249.4088 1253.6894 1294.1667 1309.4135 1336.2336 1359.7450 1360.9514 1382.6266 1384.3486 1401.3389 1420.5109 1433.3036 1460.9687 1464.8162 1473.6268 1476.3967 1486.6950 1502.1971 1570.5230 1604.5059 1618.2783 1624.6269 1644.7219 2878.8307 2988.6356 2995.3705 3009.8027 3016.8393 3067.7648 3070.9690 3075.3301 3091.9100 3106.4693 3133.3581 3145.4137 3159.1571 3178.1162 3212.0026
redmass: 8.5846 4.8350 4.7635 2.6676 4.0435 4.6716 4.7238 3.2488 2.5049 3.9949 4.5111 1.0377 3.9910 4.0748 1.4632 4.9125 4.9740 3.7716 3.1019 4.5364 2.9890 5.9568 3.6020 5.0804 3.1926 3.7521 3.1999 6.7232 4.6325 3.6426 1.6059 4.9867 4.5384 1.1037 5.1084 1.2937 3.9981 1.8754 3.1300 1.3624 1.6748 1.3831 4.0049 3.7058 2.2945 1.7005 2.1540 4.3687 2.2204 3.0736 1.4690 1.5406 1.3398 1.2657 4.2852 1.1319 3.0869 1.3093 1.3684 2.5343 1.3984 1.2261 5.9157 1.2424 1.2704 2.9393 1.1389 1.0887 1.0403 1.0599 1.0500 1.0744 2.5424 7.8392 7.6309 9.7284 7.4050 9.2493 1.0870 1.0391 1.0358 1.0582 1.0613 1.1065 1.0991 1.0985 1.0985 1.1026 1.0979 1.0886 1.0913 1.0953 1.0944
irintensity: 4.3773 2.6690 0.1940 0.2202 7.3168 0.4025 4.0295 4.1167 5.2534 0.5577 1.9894 0.3150 8.7044 2.4204 1.9655 11.1455 0.4128 10.4476 3.6417 15.6287 0.1676 9.8575 1.1823 2.3283 6.7610 3.6724 3.3542 1.3865 12.1803 24.0603 25.5088 8.8323 11.4497 1.9606 3.2563 8.9884 9.7269 37.8831 12.4419 2.5753 74.4358 2.5763 40.6311 33.3302 42.6014 7.5471 5.2722 353.9029 2.6341 7.3618 5.7250 9.7194 317.1581 2.4498 66.0830 0.0339 319.5810 8.7161 32.3018 324.4692 16.4608 4.9743 7.7927 48.1962 20.0000 6.2739 41.0940 8.1902 12.3283 5.2873 27.7492 18.2047 65.8731 28.1691 155.9424 113.6983 260.3983 155.0653 73.0916 6.7787 22.0503 22.2817 17.3034 7.6121 8.1192 6.9524 32.6219 45.5435 6.7891 16.7641 1.0349 3.5913 0.2209
temp: 298.150 k
press: 1.00000 atm
elementType: 8 8 8 8 7 6 6 6 6 6 6 6 6 6 6 6 6 6 1 1 1 1 1 1 1 1 1 1 1 1 1 1 1
symmnumber: 1
zpe: 674153.6 jmol-1
zpe.correction: 0.256772 hartree
zpe.thermalcorrener: 0.275322 hartree
zpe.thermalcorrenthalpy: 0.276267 hartree
zpe.thermalcorrgfe: 0.207302 hartree
zpe.sumelectzpe: -858.694696 hartree
zpe.sumelectthermal: -858.676145 hartree
zpe.sumelectthermalent: -858.675201 hartree
zpe.sumelectthermalfe: -858.744165 hartree
dipole: -0.3319 2.5689 1.4468
dipole: 2.9669
quadrupole: -90.7439 -123.2238 -105.6973
quadrupole: 15.2044 -6.5866 -3.5023
quadrupole: 15.8111 -16.6688 0.8577 15.2044 -6.5866 -3.5023
hfenergy: -858.9514673 hartree
pointgroup: C01 [X(C13H15N1O4)]
dipole: 0.1441127 -1.0131748 0.5614643 debye
polarizability: 258.9668892|0.1223436|166.6366974|1.9759686|-0.3514587|91.5783174 unknown
InChI: InChI=1S/C13H15NO4/c1-3-18-13(17)11-4-6-12(7-5-11)14(8-9-15)10(2)16/h4-7,9H,3,8H2,1-2H3
charge 0 multiplicity 1
33 atoms
O  -3.874972 -0.584982 -0.091644
O  2.989565 2.27095 -0.750967
O  -3.849982 1.731945 0.176476
O  4.089544 -3.128715 -0.07944
N  2.531317 0.198046 0.260895
C  1.094873 0.322614 0.183124
C  3.081727 -1.06493 0.789994
C  0.449941 1.585153 0.301258
C  0.298889 -0.845831 0.016498
C  -1.7460 0.497896 0.101836
C  -0.952467 1.662727 0.261371
C  -1.104647 -0.759077 -0.021236
C  3.410609 1.203244 -0.224979
C  -3.227497 0.644899 0.070187
C  4.909598 0.937857 -0.081397
C  3.461432 -2.073035 -0.308733
C  -5.367213 -0.531473 -0.138075
C  -5.853821 -1.963867 -0.330883
H  2.342341 -1.536711 1.462448
H  3.973965 -0.879537 1.412807
H  1.044638 2.491546 0.410932
H  0.763041 -1.829809 -0.104059
H  -1.457033 2.62942 0.359157
H  -1.711043 -1.658929 -0.154381
H  5.232352 -0.007249 -0.553436
H  5.220765 0.909262 0.979845
H  5.430912 1.771773 -0.572853
H  3.137667 -1.783896 -1.342124
H  -5.72797 -0.08363 0.805664
H  -5.664882 0.13431 -0.968333
H  -6.958235 -1.980805 -0.370874
H  -5.466527 -2.389223 -1.272623
H  -5.527485 -2.607742 0.503844
