program: Gaussian 09
title: 000254317
version: EM64L-G09RevD.01
frameworkgroup: C1[X(C13H13N5O2S)]
method: RPBEPBE
basis: SDD
operation: Freq
keyword: #p
keyword: freq=noraman
keyword: PBEPBE/SDD
title: #p freq=noraman PBEPBE/SDD
converged: YES YES NO NO
title: Mulliken charges:
elementType: S O O N N N N N C C C C C C C C C C C C C H H H H H H H H H H H H H
charge: 0.253621 -0.266030 -0.265653 -0.165446 -0.218922 -0.366883 -0.045758 0.003583 0.104756 0.108772 0.136646 0.213952 -0.171188 -0.614524 -0.598056 -0.784186 0.465965 -0.300396 -0.463790 -0.175331 -0.323908 0.344377 0.243921 0.275153 0.245454 0.268778 0.250860 0.250737 0.307833 0.293440 0.254192 0.254259 0.236159 0.247614
chargesum: 0.00000
title: Mulliken charges with hydrogens summed into heavy atoms:
elementType: S O O N N N N N C C C C C C C C C C C C C
charge: 0.253621 -0.266030 -0.265653 -0.165446 -0.218922 -0.022505 -0.045758 0.003583 0.104756 0.108772 0.136646 0.213952 -0.171188 0.150004 0.172319 -0.182914 0.465965 -0.046204 -0.209531 0.060829 -0.076294
polarizability: 3.42128766e+02 2.12680356e+00 1.70537391e+02 2.08543421e-01 -3.23136317e+00 1.25092363e+02
1716.lowfreq: -1.3084 -0.0014 0.0014 0.0015 4.8364 9.6400 17.7856 19.8684 35.8406
frequency: 17.1976 19.5728 35.7981 47.8153 72.9228 84.5644 101.5415 103.1918 114.2188 120.4311 160.1851 182.5418 213.4260 229.6110 288.7394 305.3295 314.6247 337.5846 357.6715 364.3532 375.2405 391.6351 400.3259 467.1505 476.6201 488.1342 567.1652 586.8089 622.1742 627.8243 637.8031 650.9449 679.2965 679.4059 703.3886 721.4777 739.1856 765.3171 804.3585 830.2009 887.1788 925.8394 926.1276 935.9976 950.5252 968.3170 991.7264 1006.5931 1028.8850 1037.0780 1100.6115 1101.9368 1129.5610 1131.6969 1134.8453 1167.9531 1192.6453 1196.5469 1227.0649 1234.2079 1255.6625 1261.3989 1286.7788 1311.5553 1325.7240 1340.2845 1371.6347 1392.1537 1415.8522 1418.8069 1429.6127 1449.7976 1460.5463 1472.3089 1474.1352 1478.5070 1480.0855 1512.0494 1556.4372 1580.1638 1587.7502 1619.0299 1659.0388 3006.0498 3012.1818 3054.1952 3094.9483 3104.4615 3119.0791 3131.6617 3134.1375 3137.7305 3138.5954 3140.8844 3169.6705 3586.3897
redmass: 5.9462 4.5076 6.0455 4.6537 4.6300 1.0876 4.1329 1.3643 3.8835 3.8705 7.0773 4.7001 9.1528 4.4068 3.2098 5.6538 2.5412 4.0651 7.2532 7.3966 6.1743 3.3085 6.8085 5.3335 7.7208 9.4777 6.2895 6.8508 7.1894 11.3274 1.3542 6.4154 6.4184 5.1707 11.1932 1.8037 11.4042 4.9100 3.6028 2.0626 1.5177 2.5241 1.8474 6.0153 1.4889 3.8680 1.3957 3.6577 3.1246 3.2520 1.8939 2.3902 1.3018 1.2997 1.1567 1.8816 3.3272 1.4266 2.7297 1.6500 1.5015 5.5602 6.9394 8.5797 11.2067 1.2284 4.9826 3.0136 2.0810 1.3090 1.2830 1.1165 2.2228 1.0441 1.2046 1.0676 1.0431 3.2613 5.5450 8.4447 5.8803 10.5681 10.4668 1.0337 1.0327 1.0579 1.1026 1.1022 1.0917 1.1087 1.0882 1.1025 1.1008 1.0929 1.1000 1.0821
irintensity: 0.8981 1.7412 1.3702 1.2963 0.3192 0.0009 0.6719 0.8256 0.2235 3.4928 5.2735 17.5257 1.8262 1.3399 3.6867 0.0711 1.3530 9.1991 0.9549 14.1908 12.5152 3.4057 18.5736 0.1943 14.4882 15.1721 13.3198 8.9147 10.6862 1.8485 89.2017 25.5020 12.5800 18.1927 5.0639 41.3258 13.2654 0.6299 11.8818 22.3265 2.0047 5.8054 0.0635 12.6002 1.0820 40.6073 0.1013 11.7302 0.3293 39.8116 17.3545 19.9558 0.3492 0.1996 5.0486 20.4752 66.1851 3.2504 3.6133 0.5866 40.8263 31.3458 39.3111 3.8996 94.6278 1.6112 4.8649 472.4760 19.2603 171.6834 75.2592 25.9306 19.1613 18.2578 2.5619 5.5727 17.9003 146.8772 8.0845 13.5196 2.7947 557.7810 568.8466 33.3927 31.0724 4.0386 18.5665 17.1268 18.9569 4.0528 0.1177 0.8305 0.4085 21.7910 22.3725 94.0761
temp: 298.150 k
press: 1.00000 atm
elementType: 16 8 8 7 7 7 7 7 6 6 6 6 6 6 6 6 6 6 6 6 6 1 1 1 1 1 1 1 1 1 1 1 1 1
symmnumber: 1
zpe: 663511.2 jmol-1
zpe.correction: 0.252718 hartree
zpe.thermalcorrener: 0.272248 hartree
zpe.thermalcorrenthalpy: 0.273192 hartree
zpe.thermalcorrgfe: 0.201391 hartree
zpe.sumelectzpe: -1323.977309 hartree
zpe.sumelectthermal: -1323.957779 hartree
zpe.sumelectthermalent: -1323.956835 hartree
zpe.sumelectthermalfe: -1324.028636 hartree
dipole: 3.1344 0.5245 2.0085
dipole: 3.7595
quadrupole: -148.3918 -135.2664 -126.4586
quadrupole: -0.0807 15.7435 -0.3388
quadrupole: -11.6862 1.4392 10.2470 -0.0807 15.7435 -0.3388
hfenergy: -1324.2300272 hartree
pointgroup: C01 [X(C13H13N5O2S1)]
dipole: -1.2359479 0.2157798 -0.7833667 debye
polarizability: 342.1277353|-2.1022163|170.452564|-0.575027|3.7854878|125.1782205 unknown
InChI: InChI=1S/C13H13N5O2S/c1-17-10-9(11(19)18(2)13(17)20)15-12(16-10)21-7-8-4-3-5-14-6-8/h3-6,15H,7H2,1-2H3
charge 0 multiplicity 1
34 atoms
S  -1.787784 -1.327009 0.144392
O  3.952392 -2.626115 -0.0601
O  4.952397 1.99263 -0.08123
N  2.687222 1.381294 -0.003441
N  4.433985 -0.294241 -0.06952
N  0.978743 -1.733835 0.050775
N  0.381568 0.4671 0.075341
N  -6.296249 0.254467 1.114322
C  2.170682 -0.994018 0.007591
C  1.767061 0.346833 0.025146
C  3.539291 -1.425819 -0.042011
C  4.075076 1.083916 -0.052858
C  -0.063007 -0.820273 0.089218
C  2.243444 2.787984 0.018674
C  5.888454 -0.570058 -0.119744
C  -2.582317 0.426182 0.238743
C  -4.071831 0.299365 0.067103
C  -4.665921 0.13702 -1.211346
C  -4.937444 0.350732 1.191265
C  -6.069534 0.036877 -1.312112
C  -6.842398 0.098123 -0.128041
H  0.9239 -2.752396 0.055246
H  1.608976 3.000132 -0.858355
H  3.143216 3.419602 -0.003953
H  1.661774 2.987702 0.934264
H  6.012951 -1.662769 -0.13126
H  6.387582 -0.133018 0.760455
H  6.328224 -0.12061 -1.024962
H  -2.09514 1.009403 -0.556949
H  -2.297789 0.842766 1.216361
H  -4.035957 0.088495 -2.106925
H  -4.525292 0.478627 2.200305
H  -6.560011 -0.085984 -2.282655
H  -7.934861 0.020293 -0.16304
