program: Gaussian 09
title: 000250321
version: EM64L-G09RevD.01
frameworkgroup: C1[X(C18H10N2O4)]
method: RPBEPBE
basis: SDD
operation: Freq
keyword: #p
keyword: freq=noraman
keyword: PBEPBE/SDD
title: #p freq=noraman PBEPBE/SDD
converged: YES YES NO NO
title: Mulliken charges:
elementType: O O O O N N C C C C C C C C C C C C C C C C C C H H H H H H H H H H
charge: -0.296313 -0.217690 -0.156186 -0.152820 -0.013636 0.027217 0.201499 0.241656 0.038512 0.096218 -0.402949 -0.403194 -0.304951 -0.384054 -0.225749 -0.225461 0.147308 0.072498 -0.268823 -0.236918 -0.278277 -0.287176 0.155677 0.138240 0.284521 0.284380 0.308117 0.259461 0.235096 0.240245 0.277526 0.287771 0.279191 0.279065
chargesum: 0.00000
title: Mulliken charges with hydrogens summed into heavy atoms:
elementType: O O O O N N C C C C C C C C C C C C C C C C C C
charge: -0.296313 -0.217690 -0.156186 -0.152820 -0.013636 0.027217 0.201499 0.241656 0.038512 0.096218 -0.118428 -0.118814 0.003165 -0.124593 0.009347 0.014783 0.147308 0.072498 0.008703 0.050852 0.000913 -0.008112 0.155677 0.138240
polarizability: 6.82871673e+02 -1.40516229e+01 2.20244784e+02 5.48620649e+00 2.76929790e+00 9.92676404e+01
1716.lowfreq: -9.0616 -0.0008 -0.0005 0.0002 0.9379 4.9612 19.2631 36.5951 42.7160
frequency: 19.2363 36.5761 42.7018 52.8627 79.0230 90.0718 118.2355 157.1887 171.6369 179.5017 190.2101 227.4187 245.1510 264.9124 291.9008 315.2844 339.3100 388.9280 451.5947 459.8452 467.9014 496.4372 510.3572 522.5277 536.9510 571.4683 591.0785 602.4127 616.5136 623.3566 647.8519 663.9109 692.7821 697.8862 704.1147 709.1147 716.6906 750.7327 769.6113 782.8350 791.4524 808.2951 813.2062 818.9583 829.7445 841.0569 851.3670 874.2281 916.6497 939.5689 946.1691 950.5432 957.4076 996.0584 1007.3013 1032.7709 1033.8938 1056.5273 1060.6260 1072.0957 1083.3758 1141.2893 1173.3182 1183.6011 1187.9890 1201.4221 1233.5885 1241.1035 1260.6444 1306.9556 1320.7659 1358.5401 1397.1886 1409.8508 1411.9417 1449.7182 1504.8826 1544.2692 1555.0403 1562.6025 1570.4537 1596.8417 1627.9861 1643.5250 1706.7071 1710.5151 3134.4689 3146.8119 3153.8109 3168.8493 3182.0923 3186.5931 3209.6459 3215.8532 3235.4642 3241.9347
redmass: 8.4107 6.7678 9.0835 5.4311 6.1221 6.8687 7.1803 8.8908 8.5878 6.8987 4.8836 5.7046 6.4212 5.1665 4.4560 6.7118 6.6852 5.0824 6.7371 6.5755 3.7022 5.3015 6.7015 6.4204 5.2511 3.2145 4.6781 5.2240 8.7656 4.1624 7.4072 6.8187 7.5303 5.7643 6.3416 5.8088 7.4646 1.5834 8.8124 7.1892 7.5175 1.5047 1.4414 1.4958 9.1420 6.3732 2.9397 5.4776 1.4105 1.3289 1.3224 5.4412 1.3970 1.3449 1.3612 2.3111 2.4209 1.9142 1.6184 1.8383 1.8356 1.9016 2.0919 1.9566 1.9527 1.6063 2.5458 2.0574 2.1745 1.8338 2.0991 5.8430 2.4917 5.9130 2.8028 2.4567 4.1955 6.5405 5.7596 5.3831 7.0787 6.9223 11.3186 10.8549 12.3195 12.3100 1.0873 1.0878 1.0940 1.0950 1.0954 1.0958 1.0900 1.0907 1.1086 1.1085
irintensity: 0.4511 1.4367 1.8325 4.8449 5.8246 4.3642 1.2767 3.2984 3.9560 3.0220 4.0971 3.2092 2.8336 1.4251 1.9108 1.4707 0.6361 0.7287 9.4839 6.4820 0.8494 1.2569 4.1680 5.2006 1.0536 10.0312 58.9105 38.9629 7.6513 3.4253 8.5392 81.1592 70.3536 10.1042 1.9704 2.6814 8.6693 5.2827 121.2623 6.3003 104.5956 4.9840 246.3806 46.6693 70.0015 15.6809 7.4115 14.7464 7.7737 0.5941 0.1851 12.8880 0.9582 1.3099 3.3201 33.2193 101.6136 42.0502 46.0887 14.1934 0.9377 24.7012 108.0912 125.0894 92.6933 57.2237 14.0632 22.8452 36.2426 2.9721 2.8493 21.3786 13.6112 8.0066 4.3842 0.2128 111.1217 54.5678 75.4099 48.1824 14.1440 10.8675 33.5895 30.0210 1423.1612 188.4160 11.0757 7.4342 9.6610 5.6500 8.4855 1.7484 1.0869 2.0852 0.1593 0.1542
temp: 298.150 k
press: 1.00000 atm
elementType: 8 8 8 8 7 7 6 6 6 6 6 6 6 6 6 6 6 6 6 6 6 6 6 6 1 1 1 1 1 1 1 1 1 1
symmnumber: 1
zpe: 619986.7 jmol-1
zpe.correction: 0.236140 hartree
zpe.thermalcorrener: 0.254829 hartree
zpe.thermalcorrenthalpy: 0.255773 hartree
zpe.thermalcorrgfe: 0.187223 hartree
zpe.sumelectzpe: -1100.660538 hartree
zpe.sumelectthermal: -1100.641849 hartree
zpe.sumelectthermalent: -1100.640905 hartree
zpe.sumelectthermalfe: -1100.709455 hartree
dipole: -1.3842 6.6693 2.3822
dipole: 7.2160
quadrupole: -169.3893 -128.3566 -137.6223
quadrupole: -0.0866 14.0659 1.1272
quadrupole: -24.2666 16.7661 7.5005 -0.0866 14.0659 1.1272
hfenergy: -1100.8966783 hartree
pointgroup: C01 [X(C18H10N2O4)]
dipole: 0.7294555 0.4636058 2.7042121 debye
polarizability: 682.4696241|2.7700504|102.0891589|-19.966816|-18.6873878|217.8253152 unknown
InChI: InChI=1S/C18H10N2O4/c21-17-9-7-15(23-17)19-13-5-1-3-11-12(13)4-2-6-14(11)20-16-8-10-18(22)24-16/h1-10H
charge 0 multiplicity 1
34 atoms
O  4.858628 0.371256 -1.292961
O  -5.199871 -0.427628 -0.843118
O  6.987108 0.79798 -2.228884
O  -7.475028 0.174559 -0.68113
N  3.17111 -0.160537 0.399249
N  -2.906709 -0.634864 -0.444225
C  0.764357 -0.400494 0.332609
C  -0.480404 -0.382569 -0.399381
C  2.004776 -0.130792 -0.380809
C  -1.723276 -0.615737 0.313626
C  0.753005 -0.689471 1.733006
C  -0.473715 -0.123309 -1.804214
C  1.966593 0.132104 -1.773007
C  -1.691136 -0.916531 1.6935
C  -0.453087 -0.958229 2.390959
C  0.73225 0.125301 -2.472999
C  4.400069 0.047076 0.037494
C  -4.049576 -0.17614 -0.038721
C  5.573403 -0.006282 0.914937
C  -4.462448 0.666874 1.106468
C  6.702263 0.266472 0.186461
C  -5.804202 0.914002 1.007477
C  6.323342 0.516664 -1.222754
C  -6.335336 0.233411 -0.202276
H  1.708995 -0.709431 2.261446
H  -1.42719 -0.138537 -2.340489
H  2.89869 0.333687 -2.306031
H  -2.618575 -1.182234 2.212758
H  -0.44941 -1.211862 3.456407
H  0.729003 0.313398 -3.551532
H  5.49145 -0.234646 1.976788
H  -3.765731 1.044172 1.854275
H  7.736742 0.309311 0.523176
H  -6.436489 1.519324 1.655994
