program: Gaussian 09
title: 000254420
version: EM64L-G09RevD.01
frameworkgroup: C1[X(C18H26N2O7)]
method: RPBEPBE
basis: SDD
operation: Freq
keyword: #p
keyword: freq=noraman
keyword: PBEPBE/SDD
title: #p freq=noraman PBEPBE/SDD
converged: YES YES NO NO
title: Mulliken charges:
elementType: O O O O O O O N N C C C C C C C C C C C C C C C C C C H H H H H H H H H H H H H H H H H H H H H H H H H H
charge: -0.280098 -0.291161 -0.278431 -0.262723 -0.262234 -0.241991 -0.261841 -0.171157 -0.405975 -0.103366 -0.046886 -0.521752 -0.004448 -0.351508 -0.222655 0.212317 0.319173 0.240777 -0.519730 0.095275 0.299775 -0.355846 -0.762637 -0.480004 -0.361951 -0.686177 -0.683575 0.298784 0.230307 0.279038 0.249365 0.287993 0.270275 0.242872 0.273178 0.361444 0.288256 0.235535 0.210305 0.221148 0.209852 0.249897 0.247600 0.240154 0.228731 0.242748 0.220817 0.207300 0.232487 0.218135 0.224382 0.206462 0.211762
chargesum: 0.00000
title: Mulliken charges with hydrogens summed into heavy atoms:
elementType: O O O O O O O N N C C C C C C C C C C C C C C C C C C
charge: -0.280098 -0.291161 -0.278431 -0.262723 -0.262234 -0.241991 -0.261841 -0.171157 -0.044530 0.195418 0.183421 0.006651 0.283545 0.161639 0.050523 0.212317 0.319173 0.240777 0.004060 0.095275 0.299775 0.075607 -0.055287 -0.011119 0.101615 -0.028255 -0.040969
polarizability: 3.23418807e+02 -1.41241976e+01 2.18919021e+02 -2.89945935e+00 1.90762267e+01 1.64600102e+02
1716.lowfreq: -15.5816 -5.5312 -1.8334 -0.0008 -0.0006 0.0007 9.4244 13.3664 16.8568
frequency: 6.4312 13.0550 16.7449 28.5272 34.5879 38.2253 45.7135 55.5133 63.7330 77.9160 83.5518 93.9876 108.9783 110.3891 121.3520 137.6842 147.0738 153.2940 167.4363 187.7990 214.5075 217.5175 229.1019 236.4743 261.2442 278.6954 281.0017 308.0504 314.3024 330.8159 351.2846 372.8877 381.7576 397.1507 432.7289 444.3353 463.8537 487.3951 536.3717 541.0259 551.4977 580.5508 596.7490 629.9587 644.0935 684.2644 698.3090 705.3395 716.9982 722.5216 749.2215 753.3616 774.3332 780.2521 823.4752 829.4350 835.2628 848.5536 866.5230 873.0087 881.5282 881.8895 887.0555 896.1211 922.3474 942.6142 959.2976 973.3786 1009.3611 1024.9855 1045.0557 1050.5553 1057.9230 1066.4311 1067.2876 1082.0761 1084.0975 1087.3395 1105.9310 1116.5575 1130.7927 1140.1299 1144.7132 1151.3883 1178.9261 1206.9268 1223.6823 1225.4007 1227.5094 1234.5335 1255.3223 1264.0467 1274.5162 1278.2427 1296.1593 1307.2735 1313.3898 1323.5192 1338.9796 1340.0450 1344.1946 1353.9122 1354.7082 1363.9477 1365.3645 1374.5087 1389.3183 1390.7854 1406.4007 1425.5514 1440.2129 1446.0352 1448.1622 1450.1006 1463.3023 1472.3834 1473.9609 1476.4308 1477.8639 1479.8247 1486.6283 1491.3246 1618.3323 1638.8579 1642.5152 1646.5989 1667.4369 2973.6471 2978.2938 2978.5332 2982.5675 2987.4979 2987.8047 3000.3216 3003.3486 3020.4195 3044.1874 3045.2073 3046.3433 3062.2033 3067.6997 3069.1936 3072.1487 3073.2618 3076.9442 3077.2662 3082.5806 3084.8853 3095.7195 3113.9575 3123.5928 3173.1722 3524.5107
redmass: 4.3367 3.6181 5.0693 3.9552 4.1614 3.8398 3.8023 5.0155 3.2597 2.6884 5.5081 5.2652 3.1778 1.9158 1.5035 3.4917 3.3508 4.2359 6.2946 6.2421 1.8095 4.4990 1.0996 4.3313 2.8770 3.2710 2.7369 3.3813 3.8134 3.3716 4.1002 4.6560 5.5128 2.8589 3.1009 3.8338 4.7934 5.0827 3.3544 4.3139 3.6291 3.5942 6.0349 3.7383 3.8135 5.2897 2.5733 3.7771 4.1088 5.2819 1.1619 6.7734 1.7321 2.1830 3.0748 3.9506 4.0144 3.1586 2.7361 1.4083 1.9633 1.5322 2.0231 2.4451 2.6966 2.4390 4.3447 2.0435 3.0079 2.0149 2.2093 1.4852 2.5127 2.4230 1.7424 2.0029 2.4484 2.6314 2.2516 3.0169 2.2616 4.6187 2.4140 2.6676 1.3434 1.1983 4.2930 1.3068 1.2998 1.5963 1.7123 1.2338 1.3945 1.2586 1.3027 1.2545 1.4422 1.2987 1.8262 1.4832 1.4233 1.5721 1.5329 1.5848 1.7189 2.0096 1.2222 1.2122 1.2607 2.6566 1.0869 1.0912 1.0972 1.0436 1.0750 1.0819 1.0831 1.0416 1.0491 1.0422 1.0507 1.0885 6.2293 9.1722 9.9821 9.3866 6.1891 1.0360 1.0365 1.0838 1.0652 1.0623 1.0364 1.0617 1.0606 1.0655 1.1002 1.0989 1.0575 1.0969 1.0975 1.0975 1.0868 1.0870 1.0989 1.0990 1.1010 1.1007 1.1006 1.1001 1.1082 1.0930 1.0769
irintensity: 1.9073 0.2038 0.3821 0.1940 0.3900 0.2885 3.2382 1.9180 1.2473 0.4356 0.1912 0.7085 5.3049 0.0610 0.3400 1.4937 1.7549 0.4117 3.9497 4.5652 3.8641 8.2956 0.1222 5.5980 5.3413 5.0091 4.7548 20.9352 2.2002 2.6155 8.2009 12.2958 10.9600 19.2944 2.3613 3.8096 5.7926 2.2771 3.2351 24.3331 6.4399 6.7655 8.1367 1.0551 6.0634 7.7919 6.7796 2.9009 7.8034 2.4145 12.4974 14.9269 8.8317 110.7721 9.4130 12.1979 14.8093 6.3155 11.6110 4.9368 4.0776 22.0995 16.6596 29.9136 98.5412 10.0596 126.7269 37.2919 147.7627 136.6715 24.5006 3.6165 3.7979 27.8193 24.5558 126.6259 202.8161 1.4398 4.4218 55.7833 57.9447 43.6869 247.6695 53.7024 57.6275 6.3883 12.4628 2.2494 11.7908 20.6794 136.7051 10.6508 20.7970 23.5397 11.3376 67.1507 44.2458 18.0647 32.5714 29.9305 0.0898 39.5399 25.0196 3.6504 37.2302 23.3416 17.2875 8.0647 22.0723 68.6213 34.0678 18.9568 14.6650 9.7175 11.2172 4.8922 22.3759 10.0746 17.6622 4.7463 13.8538 17.7916 220.0148 221.4692 162.0574 213.0940 562.4437 40.3506 30.8191 22.8553 8.3077 20.0503 20.9536 20.8420 17.1709 10.4416 2.4322 2.1979 20.8973 2.5207 12.3789 12.8434 0.4023 16.2203 23.4234 68.5403 55.1506 57.5310 14.6616 5.8343 6.0174 4.1947 61.1960
temp: 298.150 k
press: 1.00000 atm
elementType: 8 8 8 8 8 8 8 7 7 6 6 6 6 6 6 6 6 6 6 6 6 6 6 6 6 6 6 1 1 1 1 1 1 1 1 1 1 1 1 1 1 1 1 1 1 1 1 1 1 1 1 1 1
symmnumber: 1
zpe: 1123099.1 jmol-1
zpe.correction: 0.427766 hartree
zpe.thermalcorrener: 0.456727 hartree
zpe.thermalcorrenthalpy: 0.457671 hartree
zpe.thermalcorrgfe: 0.361839 hartree
zpe.sumelectzpe: -1335.560261 hartree
zpe.sumelectthermal: -1335.531300 hartree
zpe.sumelectthermalent: -1335.530356 hartree
zpe.sumelectthermalfe: -1335.626189 hartree
dipole: -3.8961 -2.3976 -2.1940
dipole: 5.0737
quadrupole: -192.6264 -153.4902 -164.4646
quadrupole: -4.4991 -3.2004 0.8100
quadrupole: -22.4327 16.7035 5.7291 -4.4991 -3.2004 0.8100
hfenergy: -1335.9880273 hartree
pointgroup: C01 [X(C18H26N2O7)]
dipole: -1.5871362 -0.9621832 -0.7346707 debye
polarizability: 322.3315021|-15.4559765|221.5158735|-9.1773077|16.5896331|163.0905553 unknown
InChI: InChI=1S/C18H26N2O7/c1-4-6-15(21)25-10-13-12(27-16(22)7-5-2)8-14(26-13)20-9-11(3)17(23)19-18(20)24/h9,12-14,19H,4-8,10H2,1-3H3
charge 0 multiplicity 1
53 atoms
O  1.10156 -0.891324 0.966247
O  -1.273031 0.966095 0.187322
O  -2.375131 -2.202153 0.859522
O  3.543571 2.310907 0.73817
O  -3.188539 0.726883 -1.130166
O  7.111553 -0.389491 -0.620544
O  -3.773611 -0.715509 1.99812
N  3.07856 0.104621 0.038805
N  5.29402 0.907468 0.0608
C  -0.584612 -0.099675 -0.588144
C  -0.200324 -1.271703 0.347517
C  0.786076 0.451696 -1.012247
C  1.633218 0.306132 0.275014
C  -1.171534 -1.590718 1.486822
C  3.556709 -1.122498 -0.431242
C  3.945882 1.191395 0.317044
C  -2.602231 1.286575 -0.177191
C  4.884392 -1.375687 -0.680588
C  -3.166444 2.329983 0.763041
C  5.863302 -0.303821 -0.434516
C  -3.632708 -1.66356 1.192859
C  -4.326618 3.143511 0.148611
C  5.400487 -2.704135 -1.174343
C  -4.740011 -2.386122 0.45227
C  -5.854524 -1.420281 -0.021896
C  -3.882863 4.063282 -1.009253
C  -7.008163 -2.177977 -0.710077
H  -1.237285 -0.413046 -1.41944
H  -0.045073 -2.180647 -0.269661
H  0.729853 1.495224 -1.356092
H  1.209176 -0.169598 -1.823026
H  1.54226 1.189155 0.927776
H  -1.451533 -0.68968 2.054765
H  -0.731185 -2.34579 2.158044
H  2.79132 -1.893507 -0.54867
H  5.948402 1.673833 0.249304
H  -3.519694 1.768209 1.651938
H  -2.345096 2.984441 1.105801
H  -4.783234 3.749743 0.954003
H  -5.105643 2.44463 -0.20948
H  4.579831 -3.426872 -1.321806
H  6.124539 -3.132325 -0.457677
H  5.944017 -2.582313 -2.128709
H  -4.304599 -2.943641 -0.394311
H  -5.175126 -3.135356 1.145533
H  -5.415063 -0.678875 -0.715469
H  -6.232903 -0.856344 0.850732
H  -3.101197 4.773585 -0.679388
H  -3.479232 3.472396 -1.851366
H  -4.734406 4.653606 -1.393092
H  -7.79285 -1.477843 -1.049061
H  -7.479214 -2.904989 -0.021376
H  -6.650353 -2.735292 -1.59623
