program: Gaussian 09
title: 000254343
version: EM64L-G09RevD.01
frameworkgroup: C1[X(C18H16O6)]
method: RPBEPBE
basis: SDD
operation: Freq
keyword: #pfreq=noraman
keyword: PBEPBE/SDD
title: #p freq=noraman PBEPBE/SDD
converged: YES YES NO NO
title: Mulliken charges:
elementType: O O O O O O C C C C C C C C C C C C C C C C C C H H H H H H H H H H H H H H H H
charge: -0.267101 -0.274300 -0.275355 -0.353575 -0.261188 -0.208624 -0.023605 0.012117 0.203607 0.267709 0.250394 0.162531 0.111993 0.032290 -0.557914 -0.563396 0.395451 -0.349277 -0.364902 -0.256389 -0.209276 -0.511008 -0.511999 -0.535913 0.282608 0.272322 0.283039 0.262926 0.238327 0.237579 0.374699 0.238608 0.239721 0.237326 0.240507 0.240767 0.238357 0.226911 0.224867 0.249167
chargesum: 0.00000
title: Mulliken charges with hydrogens summed into heavy atoms:
elementType: O O O O O O C C C C C C C C C C C C C C C C C C
charge: -0.267101 -0.274300 -0.275355 0.021124 -0.261188 -0.208624 -0.023605 0.012117 0.203607 0.267709 0.250394 0.162531 0.111993 0.032290 -0.275306 -0.291074 0.395451 -0.066238 -0.101976 -0.018062 0.028303 0.204648 0.207633 0.165031
polarizability: 3.40091465e+02 -8.82353527e-03 1.68431877e+02 -6.37378298e+00 3.04390932e+00 1.83731325e+02
1716.lowfreq: -5.4645 0.0005 0.0007 0.0007 2.7277 6.5498 16.7490 32.1274 34.0327
frequency: 16.2043 32.1018 34.0301 64.0909 75.2620 92.8073 99.2775 122.2992 127.7468 161.8369 173.0796 183.9398 188.1428 195.7303 211.6595 220.6287 230.6699 251.2075 274.0636 292.9585 298.7386 317.5678 346.9122 364.3330 388.8085 413.4684 425.3457 448.7673 470.0124 485.7788 505.3299 518.0193 531.6105 533.4813 560.9423 601.2242 613.2624 620.1384 639.4919 673.7084 682.2863 704.0803 733.5395 768.1202 800.0044 800.6849 833.4685 855.6241 860.1476 863.7524 874.6149 881.8521 953.7509 973.0671 977.4593 1002.2993 1023.6887 1034.7611 1050.7582 1068.4585 1099.6245 1106.8636 1107.8006 1112.2208 1127.8530 1137.6097 1155.9480 1159.6668 1162.6535 1166.9570 1201.3832 1202.5920 1221.2923 1265.9673 1282.8211 1304.5152 1350.1869 1390.4901 1401.9238 1403.8193 1426.4072 1444.9672 1449.7824 1451.5434 1455.7772 1457.5450 1458.3176 1462.9301 1467.7004 1473.7793 1477.8559 1479.4339 1558.2562 1559.6605 1572.2472 1599.0821 1616.1640 1620.1552 2967.0957 2988.2527 2989.7170 3057.9092 3093.3785 3094.4649 3116.3832 3118.6063 3130.7170 3139.7862 3151.9077 3164.5106 3175.2074 3188.5606 3194.4816 3489.3894
redmass: 7.1601 5.1778 5.2552 3.2513 3.0102 6.8205 3.8826 4.7413 5.3918 5.8137 4.1901 2.2590 4.2583 1.4626 1.1242 1.7541 2.7710 2.0621 5.8064 3.2942 6.9563 7.4452 4.6278 4.8938 7.1199 8.3360 5.3173 3.7621 7.6611 1.1927 5.6690 7.9211 4.1141 6.7321 6.2126 4.5061 7.0497 6.2740 3.4309 7.0280 4.8657 4.6531 3.7506 1.5973 6.5120 3.2198 1.5673 2.4798 5.6076 4.0274 6.9344 1.4531 8.9089 1.3623 9.2948 1.3268 2.0700 2.6614 4.7591 4.5021 2.4369 1.2456 1.2463 1.2589 2.2114 1.7502 1.3527 1.5390 1.1815 1.7450 1.9141 1.9463 2.3969 2.8462 1.8371 5.1843 5.4837 3.6731 9.4777 2.9948 1.4670 2.2600 1.3807 1.3901 1.3206 1.0591 2.4067 1.7047 1.0504 1.1039 1.0507 1.0561 8.0061 8.2850 9.8238 8.6883 7.0334 7.4341 1.0326 1.0293 1.0295 1.1042 1.1049 1.1049 1.1037 1.1036 1.1001 1.0861 1.0898 1.0953 1.1006 1.0913 1.0926 1.0645
irintensity: 1.3582 0.0590 0.1632 0.4775 15.3499 2.5365 2.7338 0.5092 3.1384 1.9177 0.6062 4.3125 2.8583 0.3180 0.5738 1.1461 0.0333 0.8390 5.1506 12.1085 0.1398 8.2451 1.6921 0.2259 7.2683 1.0138 10.5374 5.3084 2.4946 73.7863 5.3133 0.4787 0.4012 0.4367 4.2024 0.4922 15.9621 15.5717 3.2436 11.1199 17.3410 0.6114 4.0532 82.5190 4.1567 7.8600 11.9347 55.7440 21.1430 25.7157 5.1100 0.0013 8.5271 2.1314 6.3975 0.2677 20.7871 70.3623 124.3529 2.4360 80.1482 3.8609 3.3983 0.2284 272.9796 188.6427 21.5479 67.0674 1.1364 198.5385 40.0136 80.0202 5.7675 117.4373 33.2282 1.5110 110.7471 45.3370 7.4580 48.5954 23.2029 56.9419 3.9725 19.4625 35.4173 9.2032 3.9161 45.5010 14.5320 34.9857 36.1530 6.3083 177.9374 106.7435 75.8808 88.8140 335.4412 239.0588 65.1198 40.6487 62.3693 41.2498 21.0958 37.3664 27.6770 22.4762 24.6525 3.8187 3.8917 8.1093 21.0493 1.3356 0.2333 58.3625
temp: 298.150 k
press: 1.00000 atm
elementType: 8 8 8 8 8 8 6 6 6 6 6 6 6 6 6 6 6 6 6 6 6 6 6 6 1 1 1 1 1 1 1 1 1 1 1 1 1 1 1 1
symmnumber: 1
zpe: 789542.9 jmol-1
zpe.correction: 0.300721 hartree
zpe.thermalcorrener: 0.323149 hartree
zpe.thermalcorrenthalpy: 0.324093 hartree
zpe.thermalcorrgfe: 0.248354 hartree
zpe.sumelectzpe: -1145.065958 hartree
zpe.sumelectthermal: -1145.043529 hartree
zpe.sumelectthermalent: -1145.042585 hartree
zpe.sumelectthermalfe: -1145.118325 hartree
dipole: -0.7260 -2.2337 -5.7609
dipole: 6.2213
quadrupole: -112.6026 -135.6991 -151.3060
quadrupole: 8.0142 -16.7371 -1.0546
quadrupole: 20.6000 -2.4965 -18.1034 8.0142 -16.7371 -1.0546
hfenergy: -1145.3666787 hartree
pointgroup: C01 [X(C18H16O6)]
dipole: 0.347715 -1.2249844 2.0903296 debye
polarizability: 339.4679205|-0.643126|169.7422864|-11.7833407|-5.1852688|183.0444601 unknown
InChI: InChI=1S/C18H16O6/c1-21-10-8-13(22-2)15(14(9-10)23-3)18-17(20)16(19)11-6-4-5-7-12(11)24-18/h4-9,20H,1-3H3
charge 0 multiplicity 1
40 atoms
O  -0.955806 -0.301228 1.137831
O  1.417554 2.463104 0.775067
O  1.600346 -2.427238 -0.392018
O  0.017003 0.645033 -2.333123
O  5.547287 0.261212 0.243025
O  -2.760153 0.620802 -2.54154
C  1.294679 0.006151 0.211948
C  -0.173371 0.017663 0.003636
C  -2.99819 0.008234 -0.207219
C  2.011801 1.218678 0.528098
C  2.089243 -1.161751 -0.044813
C  -2.354908 -0.300494 1.020921
C  -0.749648 0.329087 -1.216922
C  -2.217411 0.34543 -1.426598
C  3.417493 1.266726 0.526298
C  3.503337 -1.115938 -0.046405
C  4.159669 0.103658 0.223979
C  -4.42016 -0.013751 -0.244111
C  -3.085337 -0.624048 2.187485
C  -5.160503 -0.332417 0.904211
C  -4.489482 -0.638176 2.122627
C  0.116715 2.582333 1.458882
C  0.274513 -2.905294 0.038012
C  6.372112 -0.913723 -0.059908
H  3.925368 2.203646 0.762495
H  4.035017 -2.045882 -0.256554
H  -4.901897 0.226426 -1.19773
H  -2.546964 -0.854666 3.11157
H  -6.254445 -0.346792 0.867374
H  -5.068758 -0.886306 3.018387
H  0.982919 0.620959 -2.092935
H  -0.716343 2.527781 0.737298
H  0.137389 3.581944 1.920142
H  -0.002999 1.806707 2.235059
H  0.05952 -2.608055 1.078947
H  -0.520268 -2.53691 -0.632717
H  0.341166 -4.001469 -0.039072
H  6.161419 -1.29968 -1.075511
H  6.21403 -1.717001 0.684991
H  7.409865 -0.554657 -0.005404
