program: Gaussian 09
title: 000254293
version: EM64L-G09RevD.01
frameworkgroup: C1[X(C13H18O2)]
method: RPBEPBE
basis: SDD
operation: Freq
keyword: #pfreq=noraman
keyword: PBEPBE/SDD
title: #p freq=noraman PBEPBE/SDD
converged: YES YES NO NO
title: Mulliken charges:
elementType: O O C C C C C C C C C C C C C H H H H H H H H H H H H H H H H H H
charge: -0.451107 -0.265338 -0.230934 -0.079947 -0.446472 -0.427800 -0.400917 -0.393307 0.472965 -0.444316 -0.389568 -0.354515 -0.376850 0.311835 -0.537963 0.211520 0.179124 0.219152 0.189867 0.219913 0.207998 0.196359 0.200398 0.192695 0.204346 0.342504 0.247489 0.227369 0.250530 0.238042 0.220275 0.220651 0.246003
chargesum: 0.00000
title: Mulliken charges with hydrogens summed into heavy atoms:
elementType: O O C C C C C C C C C C C C C
charge: -0.108604 -0.265338 -0.019414 0.099177 -0.037452 0.000110 -0.004160 0.003735 0.472965 -0.196827 -0.162199 -0.103985 -0.138809 0.311835 0.148965
polarizability: 2.06321542e+02 2.24199774e+00 1.17235707e+02 -4.16671673e+00 1.45461778e+01 1.14354743e+02
1716.lowfreq: -6.8008 0.0001 0.0001 0.0006 8.1782 17.4190 28.9226 50.2430 71.9061
frequency: 28.2712 50.2351 71.8836 105.0232 144.8128 174.1350 192.2335 229.8402 249.2501 263.4858 317.3864 334.3170 378.8981 394.4764 403.1136 413.8772 425.7694 442.8296 485.7723 527.0748 542.4249 561.3737 631.4456 731.3990 738.4477 776.0195 810.4688 815.9482 835.0380 842.4671 870.1947 890.5575 931.9258 947.1808 948.6079 966.6608 988.5255 1002.6113 1021.7252 1038.2147 1054.0645 1094.7834 1099.2036 1107.7542 1111.9977 1127.3574 1155.8830 1179.4330 1190.8281 1204.6338 1227.0569 1231.2805 1234.7012 1259.1638 1282.7657 1285.0312 1307.6861 1315.4972 1326.2995 1338.1073 1339.1392 1348.5700 1383.6167 1387.2852 1417.6190 1436.1871 1462.0563 1465.4970 1467.1886 1470.4749 1473.2989 1478.2223 1499.7623 1580.2787 1620.1355 2909.5316 2958.2112 2966.2763 2970.4506 2970.5715 2977.1632 2990.0012 3031.4345 3034.6807 3043.3826 3045.6836 3057.3418 3123.4684 3125.0800 3127.2494 3159.5728 3166.3272 3524.3312
redmass: 3.8170 3.9268 3.4325 3.7380 3.4416 3.6771 2.4632 2.8945 1.4907 2.5889 1.7749 3.2975 1.2346 3.3750 3.0576 2.8211 3.5924 3.3948 3.4626 2.5265 3.0227 2.7666 6.8747 3.7132 3.5009 2.1656 1.6317 2.3418 1.5427 1.7834 1.8253 1.7539 1.5412 1.9296 2.5682 1.3666 8.5782 2.6973 3.0533 1.6608 1.6129 1.5005 1.5417 2.3378 1.2596 1.6848 1.3444 1.2538 1.4794 1.7967 1.5051 3.3241 1.3217 1.2751 1.3223 1.3937 1.2992 1.2694 1.3983 1.4272 1.4209 1.5302 2.6355 2.0981 2.9638 1.1753 1.0914 1.0900 1.0505 1.0825 1.0794 1.0947 2.4028 6.9348 6.3702 1.0823 1.0331 1.0692 1.0622 1.0635 1.0766 1.0626 1.0961 1.0985 1.1016 1.1039 1.1025 1.0916 1.0958 1.0893 1.0938 1.0953 1.0652
irintensity: 0.3687 0.8149 0.0451 5.6383 1.3413 1.0306 1.5487 0.4245 0.2947 2.2274 1.8374 16.7535 108.7960 4.7304 9.5353 4.4511 0.3285 6.1071 2.7160 0.1113 23.9205 20.1676 0.6080 1.9776 3.9259 5.5845 30.3788 3.0512 36.7076 7.5221 1.4232 7.7334 4.5015 3.0092 16.6355 0.4277 41.6700 15.8602 57.9301 0.5178 0.5125 8.0300 15.3261 2.0168 0.1790 19.8576 1.2570 58.1005 2.7075 13.2064 27.3670 149.4881 15.8438 14.6024 0.8626 3.3799 0.1292 0.6807 17.2158 2.3659 1.2464 6.1138 4.0906 19.5847 0.2386 9.9570 7.4689 6.4458 13.5552 16.7560 66.0415 5.2716 118.6658 7.3189 47.5437 34.1831 67.6660 9.5991 38.2673 36.4384 35.5141 32.9476 62.2473 53.0130 51.1577 50.3857 62.4092 35.5181 8.5406 11.1194 15.3229 5.0363 3.9259
temp: 298.150 k
press: 1.00000 atm
elementType: 8 8 6 6 6 6 6 6 6 6 6 6 6 6 6 1 1 1 1 1 1 1 1 1 1 1 1 1 1 1 1 1 1
symmnumber: 1
zpe: 739696.1 jmol-1
zpe.correction: 0.281735 hartree
zpe.thermalcorrener: 0.296082 hartree
zpe.thermalcorrenthalpy: 0.297026 hartree
zpe.thermalcorrgfe: 0.240150 hartree
zpe.sumelectzpe: -655.472004 hartree
zpe.sumelectthermal: -655.457658 hartree
zpe.sumelectthermalent: -655.456713 hartree
zpe.sumelectthermalfe: -655.513590 hartree
dipole: 1.2792 -2.8259 -0.9506
dipole: 3.2443
quadrupole: -81.2687 -95.6459 -88.0169
quadrupole: 0.7503 -8.2856 5.9746
quadrupole: 7.0418 -7.3354 0.2936 0.7503 -8.2856 5.9746
hfenergy: -655.7537397 hartree
pointgroup: C01 [X(C13H18O2)]
dipole: 0.4987686 1.015076 0.5916748 debye
polarizability: 206.0469998|-4.1306158|111.7142313|5.7337839|13.8967285|120.15076 unknown
InChI: InChI=1S/C13H18O2/c1-15-11-8-6-10(7-9-11)12-4-2-3-5-13(12)14/h6-9,12-14H,2-5H2,1H3
charge 0 multiplicity 1
33 atoms
O  -1.634037 -2.262668 0.256799
O  4.338689 -0.186282 -0.063417
C  -1.424141 0.128506 -0.467269
C  -2.09841 -0.889627 0.504466
C  -2.031143 1.541699 -0.243406
C  -3.625019 -0.907742 0.338276
C  -3.568749 1.531129 -0.408812
C  -4.227571 0.502085 0.54095
C  0.097669 0.090931 -0.336577
C  0.893194 -0.552203 -1.324954
C  0.76634 0.645871 0.784154
C  2.294275 -0.629452 -1.209776
C  2.171327 0.579835 0.919754
C  2.939954 -0.060737 -0.084411
C  5.052568 0.391725 1.077015
H  -1.690443 -0.19964 -1.494085
H  -1.843977 -0.58506 1.547337
H  -1.565522 2.254902 -0.94986
H  -1.782457 1.898555 0.777263
H  -4.055986 -1.632252 1.053784
H  -3.857009 -1.278739 -0.679642
H  -3.822348 1.272842 -1.457631
H  -3.975119 2.543462 -0.219317
H  -4.074979 0.824401 1.59189
H  -5.321199 0.470119 0.374489
H  -0.64111 -2.258626 0.256739
H  0.403131 -0.989834 -2.202969
H  0.188012 1.145376 1.57039
H  2.905181 -1.120466 -1.973429
H  2.648842 1.02448 1.798215
H  4.745497 -0.083661 2.029174
H  4.892706 1.485925 1.14077
H  6.115537 0.183647 0.885888
