program: Gaussian 09
title: 000254292
version: EM64L-G09RevD.01
frameworkgroup: C1[X(C13H16O2)]
method: RPBEPBE
basis: SDD
operation: Freq
keyword: #pfreq=noraman
keyword: PBEPBE/SDD
title: #p freq=noraman PBEPBE/SDD
converged: YES YES NO NO
title: Mulliken charges:
elementType: O O C C C C C C C C C C C C C H H H H H H H H H H H H H H H H
charge: -0.186785 -0.267901 -0.341771 -0.436373 -0.404347 -0.395757 -0.512854 0.164142 0.552289 -0.445069 -0.371056 -0.355088 -0.378751 0.313835 -0.538607 0.224446 0.216011 0.229841 0.219639 0.193161 0.212269 0.215865 0.241434 0.216635 0.227260 0.239853 0.246864 0.236762 0.218624 0.222275 0.243155
chargesum: 0.00000
title: Mulliken charges with hydrogens summed into heavy atoms:
elementType: O O C C C C C C C C C C C C C
charge: -0.186785 -0.267901 -0.117325 0.009479 0.008453 0.032377 -0.054785 0.164142 0.552289 -0.217809 -0.131203 -0.108224 -0.141989 0.313835 0.145447
polarizability: 2.02862796e+02 6.30832882e+00 1.20270182e+02 1.98949046e+00 1.33904379e+01 1.07721882e+02
1716.lowfreq: -27.8059 -6.9145 -0.0006 -0.0002 -0.0001 7.4449 30.7557 46.6355 61.4434
frequency: 27.1535 46.2422 61.4256 103.1201 109.7787 166.2981 184.2551 229.9444 242.9289 254.2370 291.5754 340.2472 392.4647 407.5950 412.8085 434.6636 472.4514 513.4903 542.9075 578.0682 629.3485 660.3724 729.6042 733.3576 759.9574 805.3404 817.2539 825.8776 834.7947 856.4781 888.9281 920.0218 941.0381 956.1046 964.5994 990.0757 1005.8626 1016.1299 1060.2044 1072.2972 1092.6830 1112.1407 1113.3835 1118.1523 1156.3193 1182.5553 1194.5666 1210.4783 1223.8236 1230.7069 1248.9011 1265.4582 1290.5214 1299.5023 1312.1285 1335.6373 1338.6929 1344.9975 1387.8044 1420.0250 1435.9444 1450.9360 1464.6966 1466.0141 1466.2885 1474.0054 1475.4372 1504.1379 1585.5836 1623.3627 1632.4746 2956.7425 2957.1398 2970.8577 2979.3506 2983.3476 2985.5531 3035.4608 3044.0384 3044.9434 3054.1405 3076.8365 3116.3268 3122.2831 3143.0926 3163.1746 3166.7666
redmass: 4.0772 4.3330 3.3569 4.2452 3.6785 2.8067 3.0462 4.8608 1.6573 2.0271 1.8334 4.6584 4.2013 3.0483 2.9124 3.6954 2.4860 3.4144 2.5339 4.7500 6.6044 3.0547 3.3942 3.0952 3.2342 1.6654 1.9617 1.8072 1.7614 2.4434 1.4689 2.1599 1.6663 1.3823 2.5486 8.4805 2.5248 1.9401 1.9225 1.2678 2.0196 1.2642 1.5895 1.8574 1.3463 1.2646 1.3978 1.8189 1.5126 3.2982 1.2798 1.3287 1.4602 1.3528 1.3161 1.4272 1.6829 1.6368 4.1999 2.9373 1.1745 1.0934 1.0853 1.0505 1.0859 1.0767 1.0902 2.4791 6.9858 6.6830 9.1464 1.0718 1.0409 1.0637 1.0653 1.0608 1.0624 1.0961 1.1038 1.1018 1.1032 1.0985 1.0896 1.0992 1.0874 1.0950 1.0958
irintensity: 0.2835 3.9271 2.4278 0.9713 3.8128 4.3416 2.8246 0.2994 0.5824 0.8444 0.1249 3.4329 1.7285 0.5229 0.1450 4.7255 0.4700 18.6115 27.6624 4.9498 1.9861 4.1604 1.4780 0.3396 8.1003 31.8523 10.1234 33.8187 5.0482 5.3589 5.2793 0.6550 2.7607 0.4520 4.8283 37.2761 10.4366 16.1805 10.2627 3.1636 1.0128 0.8023 23.7589 49.6444 0.5413 64.0275 18.6476 3.4078 10.1245 162.5069 0.8835 3.8911 21.1666 8.9996 0.4164 0.3962 2.3987 2.1992 7.8792 0.1027 9.4382 13.0781 9.3822 13.1684 16.2362 57.9966 5.5578 121.1444 8.5625 90.5764 86.0685 39.0196 39.8868 34.6503 12.3019 39.3195 32.2501 50.8611 49.6720 38.7850 47.3194 25.9027 17.8898 29.1075 13.4631 17.2017 1.5265
temp: 298.150 k
press: 1.00000 atm
elementType: 8 8 6 6 6 6 6 6 6 6 6 6 6 6 6 1 1 1 1 1 1 1 1 1 1 1 1 1 1 1 1
symmnumber: 1
zpe: 679100.4 jmol-1
zpe.correction: 0.258656 hartree
zpe.thermalcorrener: 0.272666 hartree
zpe.thermalcorrenthalpy: 0.273611 hartree
zpe.thermalcorrgfe: 0.216824 hartree
zpe.sumelectzpe: -654.296850 hartree
zpe.sumelectthermal: -654.282839 hartree
zpe.sumelectthermalent: -654.281895 hartree
zpe.sumelectthermalfe: -654.338681 hartree
dipole: -1.5054 -1.6003 1.7749
dipole: 2.8244
quadrupole: -72.5600 -93.9659 -87.0595
quadrupole: 10.1888 5.5199 6.7298
quadrupole: 11.9685 -9.4374 -2.5310 10.1888 5.5199 6.7298
hfenergy: -654.5555056 hartree
pointgroup: C01 [X(C13H16O2)]
dipole: -0.5906861 -0.8621151 0.3776571 debye
polarizability: 202.7171218|5.3865554|108.3406062|5.0489218|13.7124751|119.7971322 unknown
InChI: InChI=1S/C13H16O2/c1-15-11-8-6-10(7-9-11)12-4-2-3-5-13(12)14/h6-9,12H,2-5H2,1H3
charge 0 multiplicity 1
31 atoms
O  -1.614242 2.121783 0.281559
O  4.34759 -0.167911 -0.108496
C  -1.416035 -0.253913 -0.389766
C  -2.026017 -1.356465 0.552768
C  -3.554111 -1.493642 0.372285
C  -4.274943 -0.148586 0.614703
C  -3.687574 0.971635 -0.293753
C  -2.171628 1.064375 -0.111806
C  0.098243 -0.179053 -0.286181
C  0.910571 -0.651876 -1.350264
C  0.74466 0.316748 0.871858
C  2.315376 -0.639084 -1.26562
C  2.153014 0.339566 0.977022
C  2.942029 -0.141679 -0.097074
C  5.040342 0.351832 1.071628
H  -1.689679 -0.551547 -1.425148
H  -1.790158 -1.096957 1.604076
H  -1.516779 -2.314368 0.338548
H  -3.946047 -2.26439 1.063452
H  -3.771529 -1.846815 -0.65701
H  -4.159036 0.14935 1.675731
H  -5.360174 -0.246503 0.423695
H  -4.134879 1.953871 -0.064126
H  -3.910489 0.725396 -1.352089
H  0.43628 -1.035202 -2.262762
H  0.147184 0.715154 1.697997
H  2.942691 -1.001526 -2.085637
H  2.617154 0.738981 1.88381
H  4.788439 -0.2325 1.978502
H  4.801534 1.419857 1.24242
H  6.111814 0.243268 0.847376
