program: Gaussian 09
title: 000254287
version: EM64L-G09RevD.01
frameworkgroup: C1[X(C10H22N2)]
method: RPBEPBE
basis: SDD
operation: Freq
keyword: #pfreq=noraman
keyword: PBEPBE/SDD
title: #p freq=noraman PBEPBE/SDD
converged: YES YES NO NO
title: Mulliken charges:
elementType: N N C C C C C C C C C C H H H H H H H H H H H H H H H H H H H H H H
charge: -0.318999 -0.104631 -0.026113 -0.373936 -0.441122 -0.421005 -0.350387 -0.421613 -0.318081 -0.321153 -0.671143 -0.678928 0.176394 0.183091 0.222035 0.220311 0.176530 0.211129 0.187024 0.185982 0.204054 0.243431 0.171013 0.207675 0.200544 0.185963 0.208274 0.184306 0.203935 0.223528 0.212403 0.205313 0.226271 0.207903
chargesum: 0.00000
title: Mulliken charges with hydrogens summed into heavy atoms:
elementType: N N C C C C C C C C C C
charge: -0.075568 -0.104631 0.150281 0.031190 -0.044281 -0.022851 0.039649 -0.042925 0.068426 0.071427 -0.031276 -0.039441
polarizability: 1.41253557e+02 1.04271515e+00 1.14942793e+02 1.03929118e+00 9.84527995e-01 1.10186491e+02
1716.lowfreq: -7.1434 -0.0004 -0.0001 0.0005 13.2617 16.1626 40.9981 52.8987 62.2766
frequency: 40.8010 52.5285 62.1698 87.0578 111.9534 169.5326 200.7945 204.2970 230.9653 250.0790 280.4736 320.7803 340.1070 348.7592 427.4212 436.9401 449.3078 486.3447 500.1472 551.7897 680.4753 747.2085 790.2181 795.5138 799.6010 826.6673 849.3082 879.0985 914.5092 924.6823 964.3643 984.0890 998.8018 1058.3755 1068.1973 1073.6590 1076.7934 1084.2935 1086.8619 1109.1314 1127.8186 1132.3331 1156.5206 1182.6366 1204.9688 1210.3204 1249.8180 1257.6668 1271.1430 1283.3274 1288.5021 1306.3340 1307.6760 1328.4421 1334.4522 1343.0969 1358.1213 1363.8585 1365.8693 1381.5324 1386.6288 1387.3409 1445.4473 1451.7960 1457.3805 1458.1680 1463.1127 1464.5058 1469.7805 1473.6192 1475.8036 1477.3784 1486.2853 1489.5736 2814.0782 2825.1313 2839.3511 2845.2323 2858.1568 2960.8371 2976.5539 2981.3772 2983.1571 2983.6471 3023.1049 3024.1068 3029.5220 3030.2610 3046.7896 3048.6874 3057.5349 3073.5851 3076.6477 3089.8807 3090.8847 3419.5296
redmass: 3.0474 2.9701 2.6954 1.9605 2.3150 2.0491 1.5243 1.6430 1.8416 1.8583 1.7840 1.8865 2.6191 2.0780 2.8312 2.8701 2.3642 2.2649 2.6702 1.7075 1.5980 2.5992 1.8324 1.1992 1.3909 1.4657 2.4255 1.6161 1.7927 2.1091 2.2057 1.5987 2.0611 2.4648 1.6478 1.8751 1.8449 1.9771 1.9001 1.9508 1.9139 2.5812 1.4739 1.9948 2.0524 1.8745 1.3337 1.2071 1.2170 1.2098 1.2509 1.3473 1.2287 1.3777 1.3604 1.4950 1.4056 1.3634 1.4714 1.4143 1.2490 1.2315 1.2119 1.1697 1.0868 1.0983 1.0560 1.0922 1.0614 1.0896 1.0699 1.0528 1.0637 1.0739 1.0783 1.0732 1.0707 1.0719 1.0713 1.0630 1.0628 1.0358 1.0360 1.0612 1.0873 1.0907 1.0935 1.0878 1.0873 1.1024 1.1003 1.0987 1.0982 1.1003 1.1003 1.0743
irintensity: 0.1891 0.0759 0.0577 0.1866 0.9616 0.5895 0.6770 0.3999 1.4756 0.4268 1.1294 2.2723 1.8133 1.2084 5.6504 5.2962 7.0683 5.1453 1.3574 34.8526 72.2822 5.4802 3.0596 6.3963 5.2829 1.7181 1.6589 5.8243 0.7986 6.8820 0.7307 4.3955 10.4828 17.2077 13.5781 14.3385 14.3010 0.2089 30.1510 4.2580 9.5664 19.0469 0.6713 10.6560 52.1943 2.3702 5.9909 1.0318 4.4312 27.5311 19.0748 29.5514 2.9266 3.9827 1.8933 2.8752 0.5643 2.5397 9.0812 2.0624 24.6670 18.5514 21.7294 0.6354 13.1608 0.4821 3.3154 9.8115 3.2595 3.8840 8.4503 9.5985 8.7635 14.0092 104.0032 45.9647 140.1341 43.2341 236.0734 39.2528 21.9633 36.2124 33.8528 33.8448 15.2699 69.7105 77.7365 8.5020 25.2738 39.1995 59.7560 46.1462 71.6142 43.1867 43.5455 4.8878
temp: 298.150 k
press: 1.00000 atm
elementType: 7 7 6 6 6 6 6 6 6 6 6 6 1 1 1 1 1 1 1 1 1 1 1 1 1 1 1 1 1 1 1 1 1 1
symmnumber: 1
zpe: 814557.7 jmol-1
zpe.correction: 0.310249 hartree
zpe.thermalcorrener: 0.324220 hartree
zpe.thermalcorrenthalpy: 0.325164 hartree
zpe.thermalcorrgfe: 0.269340 hartree
zpe.sumelectzpe: -502.727889 hartree
zpe.sumelectthermal: -502.713918 hartree
zpe.sumelectthermalent: -502.712973 hartree
zpe.sumelectthermalfe: -502.768797 hartree
dipole: 0.5820 -1.0830 -0.4766
dipole: 1.3187
quadrupole: -74.5101 -75.8849 -77.4359
quadrupole: 1.8300 -1.3012 1.8308
quadrupole: 1.4336 0.0587 -1.4923 1.8300 -1.3012 1.8308
hfenergy: -503.0381373 hartree
pointgroup: C01 [X(C10H22N2)]
dipole: 0.2033276 -0.2331644 -0.416465 debye
polarizability: 141.2505592|-1.4066981|112.2602724|0.7385843|2.5020791|112.8720093 unknown
InChI: InChI=1S/C10H22N2/c1-3-12(4-2)9-10-7-5-6-8-11-10/h10-11H,3-9H2,1-2H3
charge 0 multiplicity 1
34 atoms
N  -1.864101 0.660346 -1.157988
N  1.753062 -0.066931 -0.266822
C  -0.767874 -0.01627 -0.420636
C  -1.054816 0.064074 1.094375
C  0.571678 0.660297 -0.793135
C  -2.440894 -0.534288 1.42969
C  -3.544529 0.151387 0.58865
C  -3.20033 0.068682 -0.914005
C  2.889577 0.832602 0.068916
C  2.152649 -1.205401 -1.138181
C  2.671145 1.610794 1.380564
C  2.911611 -2.310334 -0.378178
H  -0.707164 -1.104919 -0.690634
H  -1.0336 1.131711 1.394027
H  -0.244373 -0.45699 1.635994
H  0.55549 1.683913 -0.3784
H  0.628909 0.772451 -1.908766
H  -2.656054 -0.429263 2.510419
H  -2.436103 -1.622648 1.208077
H  -4.529189 -0.321384 0.771201
H  -3.620439 1.217708 0.876975
H  -1.65302 0.738925 -2.163169
H  -3.25244 -1.00709 -1.226429
H  -3.94766 0.625452 -1.509929
H  3.793941 0.206765 0.179621
H  3.102312 1.549348 -0.765304
H  1.229575 -1.643305 -1.561494
H  2.764256 -0.855912 -2.009817
H  3.545986 2.250715 1.601985
H  2.523633 0.906994 2.218272
H  1.781501 2.263926 1.327217
H  3.155438 -3.149595 -1.056409
H  2.291476 -2.691985 0.451538
H  3.860948 -1.940876 0.050175
