program: Gaussian 09
title: 000254291
version: EM64L-G09RevD.01
frameworkgroup: C1[X(C12H16O3)]
method: RPBEPBE
basis: SDD
operation: Freq
keyword: #pfreq=noraman
keyword: PBEPBE/SDD
title: #p freq=noraman PBEPBE/SDD
converged: YES YES NO NO
title: Mulliken charges:
elementType: O O O C C C C C C C C C C C C H H H H H H H H H H H H H H H H
charge: -0.243117 -0.236819 -0.220523 -0.658195 0.513843 0.246147 -0.506806 -0.481261 -0.473968 0.225139 0.193170 -0.331303 -0.674429 -0.539019 -0.538812 0.208383 0.248472 0.276231 0.231177 0.229472 0.242335 0.241137 0.233135 0.226548 0.210038 0.222196 0.227175 0.245113 0.218367 0.218867 0.247306
chargesum: 0.00000
title: Mulliken charges with hydrogens summed into heavy atoms:
elementType: O O O C C C C C C C C C C C C
charge: -0.243117 -0.236819 -0.220523 -0.201340 0.513843 0.246147 -0.230575 -0.250084 -0.002160 0.225139 0.193170 -0.090166 -0.004708 0.155465 0.145729
polarizability: 1.79632915e+02 4.14661908e+00 1.52575205e+02 -1.47290103e+01 3.63828142e+00 9.73605077e+01
1716.lowfreq: -5.3816 -4.0888 0.0005 0.0009 0.0010 9.1226 23.7747 29.3501 45.2860
frequency: 23.6440 29.2346 45.1282 70.5755 94.1833 105.7528 147.9260 174.8730 178.1363 188.9567 200.3964 238.3441 249.4487 269.7034 329.3586 354.4751 360.7888 400.6988 424.8957 459.3969 501.9442 553.0163 566.4114 579.7113 635.8045 699.1467 730.9630 737.7903 757.1636 793.3318 814.8356 872.4525 905.0144 913.0056 932.0260 984.0469 997.7880 1001.7079 1053.2017 1067.5352 1108.9905 1111.5477 1112.7808 1133.7757 1141.0648 1157.7998 1169.9414 1202.9062 1218.1494 1232.4608 1259.2943 1269.6396 1286.0710 1336.7428 1394.5769 1397.0931 1410.7407 1430.0921 1435.8587 1444.3396 1456.1394 1467.4338 1467.8074 1469.6759 1471.0160 1472.4746 1478.5788 1505.5979 1590.2117 1606.7120 1627.2816 2955.4280 2960.0710 2961.4420 2996.8618 3001.8628 3011.7168 3041.8523 3049.6668 3068.2257 3093.0251 3099.6931 3125.2379 3127.0361 3128.8130 3152.6171 3161.2509
redmass: 3.9364 3.9689 2.3078 3.2078 3.3924 3.1685 3.8293 1.9127 1.7415 3.5560 2.0089 2.2095 1.3432 1.5245 3.8484 4.0406 3.9860 2.5668 4.5754 3.1714 4.4661 3.2799 4.3467 3.7758 3.3447 4.0860 4.4511 3.2173 2.6496 1.4453 1.6690 1.5412 2.4068 1.7944 2.2475 8.1599 4.4869 1.8214 1.7926 1.8128 1.9602 1.2616 1.2630 2.0387 1.6329 1.4179 1.5305 1.4938 2.1697 1.2360 3.5721 1.2985 1.7011 1.9429 1.2100 4.0434 3.1514 1.0927 1.1842 1.3287 1.1071 1.0495 1.0504 1.0394 1.0976 1.0561 1.0505 2.6215 7.2417 6.6775 7.9929 1.0332 1.0628 1.0331 1.0362 1.0585 1.0942 1.1037 1.1039 1.1041 1.1004 1.0998 1.0982 1.0993 1.0898 1.0905 1.0943
irintensity: 1.0108 2.1001 4.1421 3.4960 12.8282 0.3168 0.1552 1.1399 1.4517 3.9519 0.7074 2.4520 2.0834 0.4947 3.9442 2.1385 6.6895 1.2128 3.1533 1.7171 1.1756 4.4069 8.6109 3.5047 20.6833 2.1590 17.5037 0.6632 11.3490 39.8045 8.5159 17.2115 12.5590 8.0750 3.5526 29.7171 33.9603 23.5699 15.9572 6.9205 34.5859 0.1362 0.6565 118.3235 6.1863 12.8447 6.0754 46.1818 118.4011 8.1634 171.7668 4.6776 28.0837 47.0529 20.0745 13.1094 18.9665 23.5018 21.5979 11.6281 17.3862 5.4710 23.9730 11.0859 80.2339 34.5248 12.1760 152.3897 53.4799 2.6173 114.1300 85.0285 16.4505 48.3057 28.1995 23.5840 15.6589 49.1624 46.9428 11.0103 32.0599 28.5105 28.9590 28.1636 3.5106 4.1390 12.0328
temp: 298.150 k
press: 1.00000 atm
elementType: 8 8 8 6 6 6 6 6 6 6 6 6 6 6 6 1 1 1 1 1 1 1 1 1 1 1 1 1 1 1 1
symmnumber: 1
zpe: 665389.3 jmol-1
zpe.correction: 0.253433 hartree
zpe.thermalcorrener: 0.269703 hartree
zpe.thermalcorrenthalpy: 0.270648 hartree
zpe.thermalcorrgfe: 0.208022 hartree
zpe.sumelectzpe: -691.370051 hartree
zpe.sumelectthermal: -691.353781 hartree
zpe.sumelectthermalent: -691.352837 hartree
zpe.sumelectthermalfe: -691.415463 hartree
dipole: -0.4884 -3.0347 -0.0100
dipole: 3.0738
quadrupole: -88.8379 -77.8483 -90.1979
quadrupole: -1.2716 -0.9056 -0.5308
quadrupole: -3.2098 7.7797 -4.5699 -1.2716 -0.9056 -0.5308
hfenergy: -691.6234845 hartree
pointgroup: C01 [X(C12H16O3)]
dipole: 0.0688973 -1.1944611 0.1759337 debye
polarizability: 174.2507503|-10.4245817|152.1550642|-22.2081156|-8.9498114|103.1628135 unknown
InChI: InChI=1S/C12H16O3/c1-4-10(13)7-9-5-6-11(14-2)12(8-9)15-3/h5-6,8H,4,7H2,1-3H3
charge 0 multiplicity 1
31 atoms
O  2.06818 1.68953 -0.635359
O  3.176186 -0.713679 -0.700679
O  -3.170363 1.70397 0.573607
C  -1.98761 -0.039326 1.801515
C  -0.619896 -0.264197 1.152343
C  -2.997382 0.468756 0.756476
C  0.067202 0.836196 0.570619
C  -0.0279 -1.541666 1.105944
C  -3.734669 -0.593746 -0.057106
C  1.32554 0.665443 -0.04045
C  1.924781 -0.637584 -0.078557
C  1.238411 -1.72723 0.497005
C  -4.526309 -0.03415 -1.250774
C  1.484804 3.034041 -0.619776
C  3.813925 -2.03004 -0.754704
H  -2.344009 -0.985325 2.247874
H  -1.917201 0.724549 2.597479
H  -0.40549 1.823213 0.598605
H  -0.541491 -2.400828 1.552463
H  -4.410058 -1.130827 0.643763
H  -2.990645 -1.349757 -0.381034
H  1.682054 -2.727099 0.479306
H  -5.261459 0.717616 -0.916721
H  -3.852391 0.466039 -1.967816
H  -5.061438 -0.842796 -1.779544
H  1.336559 3.397486 0.41581
H  0.519818 3.061945 -1.162072
H  2.22105 3.667931 -1.134939
H  3.200087 -2.753949 -1.326323
H  4.006342 -2.428353 0.261082
H  4.768472 -1.861363 -1.274142
