program: Gaussian 09
title: 000254284
version: EM64L-G09RevD.01
frameworkgroup: C1[X(C8H14O4)]
method: RPBEPBE
basis: SDD
operation: Freq
keyword: #pfreq=noraman
keyword: PBEPBE/SDD
title: #p freq=noraman PBEPBE/SDD
converged: YES YES NO NO
title: Mulliken charges:
elementType: O O O O C C C C C C C C H H H H H H H H H H H H H H
charge: -0.270014 -0.418185 -0.230125 -0.250993 -0.008041 -0.382171 -0.369717 -0.734970 -0.498767 0.171483 0.305133 -0.751287 0.195140 0.223047 0.234324 0.251459 0.222885 0.223653 0.232790 0.218636 0.245299 0.266005 0.252663 0.249149 0.245748 0.376856
chargesum: 0.00000
title: Mulliken charges with hydrogens summed into heavy atoms:
elementType: O O O O C C C C C C C C
charge: -0.270014 -0.041329 -0.230125 -0.250993 0.187100 0.075200 0.104627 -0.059891 0.012537 0.171483 0.305133 -0.003728
polarizability: 1.21124639e+02 7.82190079e-01 9.25159099e+01 2.53469041e+00 1.85147401e+00 8.21273391e+01
1716.lowfreq: -21.0025 -10.2928 -0.0011 -0.0009 0.0005 3.0689 13.7095 20.8673 32.6833
frequency: -20.1607 20.7131 32.6723 44.3771 75.5280 82.1976 106.3820 132.4683 214.8238 227.9051 243.1879 259.1979 350.4540 397.8974 408.5617 460.8690 505.3141 560.7298 582.2326 592.8633 618.3619 643.4195 769.5600 774.8389 816.4495 873.4085 919.6335 927.2665 958.5543 979.5591 1000.1843 1040.6896 1045.0603 1069.6559 1085.5774 1129.0861 1147.2204 1190.4801 1204.5933 1233.5867 1249.8162 1274.3295 1280.4460 1326.6828 1337.1725 1358.8290 1376.0462 1383.0343 1394.8469 1439.8060 1455.8760 1458.3019 1458.7766 1473.1296 1481.7519 1486.8083 1648.0804 1669.2454 2947.3511 2981.0217 2983.9109 2997.7328 3008.8878 3015.1955 3044.1660 3067.9244 3078.1244 3083.0485 3088.0955 3096.7892 3140.7582 3511.0371
redmass: 1.0756 8.1826 6.3456 5.9100 2.9445 2.4294 2.9776 3.2383 5.3841 1.5343 1.9489 4.1124 2.3479 2.7199 2.9341 2.9339 1.9354 3.0122 4.0848 3.8659 3.5423 1.3596 1.6799 2.9612 2.9335 3.6613 3.3765 1.6319 1.6862 1.9511 1.8257 2.6595 1.6451 1.9673 2.3139 1.7541 1.7721 3.4491 1.6028 1.3285 1.1755 1.4063 1.2366 1.7409 1.4947 1.3142 1.6737 1.2325 1.2193 1.0823 1.0642 1.0934 1.0471 1.0831 1.0535 1.0566 9.6264 8.1974 1.0819 1.0643 1.0370 1.0612 1.0364 1.0574 1.0944 1.1002 1.0991 1.1010 1.1071 1.0972 1.1012 1.0639
irintensity: 1.7234 1.5498 1.1499 2.3719 0.2737 1.5134 0.4835 0.9274 3.2582 3.1557 1.4356 7.5270 8.4564 3.5488 17.0699 13.5977 23.1860 12.0099 22.7981 10.9060 8.8384 122.6270 9.6057 8.9233 8.2027 0.8600 41.3218 7.6924 9.5289 80.9507 45.7279 183.6624 34.1585 13.2173 36.3737 17.3681 10.6783 326.2078 6.5184 15.4500 12.8367 17.6478 2.0617 32.7007 22.0905 9.6854 13.5553 51.3647 24.2199 24.3729 6.3767 21.3724 16.5025 3.4910 30.0621 8.7716 189.7946 206.2053 25.8428 8.0755 20.8970 15.7169 2.6913 38.0384 1.5933 26.9171 41.5541 31.3488 16.6137 7.0193 9.1383 19.7013
temp: 298.150 k
press: 1.00000 atm
elementType: 8 8 8 8 6 6 6 6 6 6 6 6 1 1 1 1 1 1 1 1 1 1 1 1 1 1
symmnumber: 1
zpe: 558193.0 jmol-1
zpe.correction: 0.212604 hartree
zpe.thermalcorrener: 0.226150 hartree
zpe.thermalcorrenthalpy: 0.227094 hartree
zpe.thermalcorrgfe: 0.169707 hartree
zpe.sumelectzpe: -613.199665 hartree
zpe.sumelectthermal: -613.186119 hartree
zpe.sumelectthermalent: -613.185175 hartree
zpe.sumelectthermalfe: -613.242562 hartree
dipole: 1.2423 -0.2325 -0.6695
dipole: 1.4303
quadrupole: -75.0374 -74.3173 -70.1700
quadrupole: -10.2766 -1.0629 -5.7808
quadrupole: -1.8625 -1.1424 3.0049 -10.2766 -1.0629 -5.7808
hfenergy: -613.4122696 hartree
pointgroup: C01 [X(C8H14O4)]
dipole: 0.5012036 0.0834588 0.2418134 debye
dipolederiv: -1.3573975 -0.1219979 0.4171077 -0.1192014 -0.5064645 0.092984 0.5769653 0.1179253 -0.5787467 -1.1294601 -0.2579055 -0.3850303 -0.1866307 -0.3554268 -0.0320556 -0.3942247 -0.0541364 -0.5986818 -0.6596897 0.1391332 -0.0229722 -0.0517656 -0.7994292 -0.320581 -0.1724775 -0.2309439 -0.4996464 -0.8255831 0.0909733 0.1492249 0.3992002 -0.7558276 0.0045363 0.0778511 0.141687 -0.4094847 0.1018669 -0.0273935 -0.0356197 -0.0861918 0.1398351 -0.0100965 -0.0106224 -0.030353 0.0934241 0.0638835 0.0114458 -0.0322634 0.0156251 0.0000174 -0.011891 -0.0118161 -0.0532682 0.090591 0.3976933 0.1485436 -0.0591993 0.420228 0.3286531 -0.1450341 -0.2114458 -0.0535566 0.3794995 -0.0249291 0.0264827 0.0059515 0.0694801 -0.0031949 -0.0741444 -0.0039173 -0.0541905 -0.0474053 -0.1607349 0.1332391 -0.0497326 0.3154349 -0.1583784 -0.0646319 -0.0202783 -0.0851599 0.1059561 1.4567627 -0.0828137 0.405545 -0.0683747 1.0128381 0.4638665 0.5109071 0.4236373 0.6145501 1.6694839 -0.0151283 -0.6189584 -0.4315896 0.9508232 -0.1305651 -0.6495368 -0.3125933 0.5988038 -0.1269676 -0.1606655 0.1342401 -0.1179403 -0.1918894 0.1543859 0.1440175 0.1831947 -0.1124625 -0.0255435 -0.0757746 0.0855923 -0.047997 -0.0644995 0.1118778 0.0397252 0.0908236 -0.0637329 0.0650429 0.0202547 0.0134549 -0.0092382 0.0391417 -0.0816629 0.0204116 -0.08246 -0.0985332 0.0533872 -0.049777 0.0304935 -0.0518906 -0.0150822 0.0732344 0.0233532 0.101176 -0.0025112 -0.0167039 0.0780568 -0.055493 -0.0080139 -0.0227084 0.0814001 0.0171879 0.0066256 0.0839863 0.0446916 -0.0250958 0.0720675 -0.068718 0.0018783 -0.1006555 0.0699112 -0.0491746 -0.1102643 -0.0818822 -0.1331089 -0.0886022 -0.1247974 0.0484232 -0.0470402 -0.0829679 -0.04499 0.0299782 -0.0504004 0.1492825 0.0109665 0.1255486 0.007664 -0.0021931 -0.0104497 0.0239213 0.07335 0.0926817 -0.0230606 0.047512 -0.0444635 -0.0378679 0.12891 0.0559002 0.0711523 -0.0289249 0.0398978 -0.0154124 0.0194117 -0.0713901 -0.0210473 0.0670119 0.0372438 0.0913227 0.0500568 0.0756294 0.0100111 -0.0007114 -0.0340465 0.0902853 -0.046662 -0.0157602 -0.0580033 -0.0652533 0.0382381 0.1220765 -0.0001344 0.0809753 -0.0020408 0.0148996 0.0172924 -0.0056717 0.1114922 -0.0367597 -0.0563816 -0.062457 -0.0452775 0.0800002 0.019156 -0.0808781 -0.0180709 0.0932222 0.1331248 0.0181973 0.0105713 -0.0011121 0.0617705 -0.0696184 0.0410981 -0.0279062 -0.0557827 0.2636677 0.0968189 0.0090349 0.1421464 0.1725267 -0.0754307 0.0325099 -0.0909873 0.3465195 unknown
polarizability: 120.7930117|-1.9131481|92.7587531|-3.8230774|1.5842124|82.2161231 unknown
InChI: InChI=1S/C8H14O4/c1-6(3-4-8(10)11)5-12-7(2)9/h6,10H,3-5H2,1-2H3
charge 0 multiplicity 1
26 atoms
O  -1.948395 -0.463569 -0.279637
O  4.63565 -0.025385 0.7177
O  3.467622 -1.519524 -0.619656
O  -3.784209 0.903102 0.211449
C  -0.061691 1.154946 -0.470429
C  1.022485 0.050671 -0.370638
C  -1.343325 0.608089 -1.128895
C  -0.375413 1.821834 0.890324
C  2.376501 0.577562 0.142219
C  3.490917 -0.443523 0.016188
C  -3.176107 -0.184106 0.337039
C  -3.647081 -1.372326 1.148715
H  0.309193 1.940089 -1.16717
H  1.175124 -0.410739 -1.365234
H  0.658117 -0.757883 0.290151
H  -2.095776 1.404219 -1.272206
H  -1.121133 0.111028 -2.089316
H  0.497994 2.371218 1.283673
H  -1.211151 2.538234 0.797436
H  -0.664169 1.061721 1.639772
H  2.689885 1.474462 -0.431671
H  2.327471 0.899578 1.197983
H  -2.923499 -2.198572 1.106069
H  -4.623525 -1.712537 0.762066
H  -3.802281 -1.062096 2.196552
H  5.355896 -0.702792 0.597416
