program: Gaussian 09
title: 000254296
version: EM64L-G09RevD.01
frameworkgroup: C1[X(C16H24O4)]
method: RPBEPBE
basis: SDD
operation: Freq
keyword: #pfreq=noraman
keyword: PBEPBE/SDD
title: #p freq=noraman PBEPBE/SDD
converged: YES YES NO NO
title: Mulliken charges:
elementType: O O O O C C C C C C C C C C C C C C C C H H H H H H H H H H H H H H H H H H H H H H H H
charge: -0.228289 -0.430064 -0.493516 -0.411826 -0.384114 -0.380818 -0.373038 -0.373037 -0.386057 -0.352994 -0.486938 -0.356923 0.105150 -0.697161 0.224429 0.103559 -0.323568 -0.152662 -0.357334 0.234913 0.193844 0.194746 0.189611 0.190384 0.187160 0.188487 0.189662 0.189901 0.212794 0.217383 0.186667 0.187115 0.243741 0.244353 0.194947 0.195097 0.214776 0.209192 0.209413 0.288342 0.259391 0.380008 0.381878 0.371396
chargesum: 0.00000
title: Mulliken charges with hydrogens summed into heavy atoms:
elementType: O O O O C C C C C C C C C C C C C C C C
charge: -0.228289 -0.050056 -0.111638 -0.040430 0.004477 -0.000824 0.002608 0.006527 0.044120 0.020789 0.001156 0.033121 0.105150 -0.063779 0.224429 0.103559 -0.035226 -0.152662 -0.097943 0.234913
polarizability: 2.78566921e+02 9.40278894e+00 1.89020198e+02 -1.31851275e-01 9.04830217e-01 1.17229415e+02
1716.lowfreq: -5.4610 -0.0016 -0.0012 -0.0005 3.7287 14.0951 15.6516 22.5071 32.0382
frequency: 15.5979 21.9636 32.0296 39.1429 66.3159 71.5743 78.3309 91.9162 113.9767 125.2345 134.0392 149.3197 154.9632 161.4770 163.5785 226.1602 235.4798 240.1381 261.4976 289.6025 291.7458 308.9451 321.1931 328.4052 375.5407 405.3597 460.8411 480.5634 487.5652 498.8199 538.4855 551.1884 563.0045 602.5466 613.7240 620.2397 693.5954 714.6890 720.2292 726.0007 737.4062 753.4023 767.9841 814.4345 830.3083 871.0810 879.7800 888.0236 947.1762 979.6298 989.2639 990.9445 1009.6393 1012.0668 1025.8131 1041.9183 1068.5134 1076.6150 1080.6264 1089.2655 1100.8632 1111.5371 1123.8031 1146.9643 1163.1485 1183.9014 1193.8592 1212.2781 1213.5640 1231.0600 1246.5971 1255.8135 1269.6115 1273.4257 1280.1769 1285.3395 1288.9290 1295.0757 1295.3929 1319.8512 1335.5421 1346.6792 1354.6245 1357.8789 1366.8691 1389.1613 1407.7136 1413.2909 1434.7687 1459.3238 1460.5622 1463.2934 1466.1545 1472.1292 1477.7494 1478.6772 1484.6041 1488.4539 1492.7167 1563.6403 1603.8835 1622.1288 2947.1384 2949.2447 2950.4175 2954.8204 2961.4857 2967.9118 2970.8309 2973.0469 2981.9750 2986.6433 2991.5628 2994.7669 3008.9387 3013.4422 3025.3336 3038.3039 3055.5250 3067.4790 3069.4488 3155.0343 3181.7610 3458.1357 3505.6862 3509.0985
redmass: 4.8308 3.3495 4.9587 1.9996 3.7435 2.6834 2.3308 3.7605 2.5554 1.8462 4.6538 2.1901 2.2090 4.8151 4.7691 4.5868 1.1121 2.9451 5.0468 3.4608 3.4222 5.3834 3.3742 2.0920 5.1217 4.1113 3.7613 3.1913 3.4762 6.9215 1.0990 4.8142 3.2304 3.7228 4.6898 1.0956 7.3928 1.4240 1.1118 1.5057 1.4481 6.2151 1.2757 1.3171 1.4013 6.0705 1.3266 1.9071 1.2622 4.9289 1.3173 4.5423 3.9361 1.1702 3.3733 3.1164 2.8456 2.4692 2.0902 2.3182 1.4074 1.6330 2.7489 1.5496 1.2165 1.8060 1.8952 1.5816 1.4937 2.0597 1.3174 1.4771 1.4719 1.1644 1.0618 1.0662 1.4109 1.0923 1.1293 1.4562 1.8864 1.5976 1.6978 1.6437 1.8487 1.2181 1.2262 5.2837 4.1209 1.0749 1.0740 1.0667 1.0798 1.0818 1.0424 1.0835 1.0888 1.0910 3.6459 7.7927 7.3678 7.0982 1.0589 1.0587 1.0591 1.0594 1.0589 1.0583 1.0369 1.0621 1.0964 1.0981 1.0608 1.1003 1.1016 1.0979 1.1045 1.1046 1.1028 1.1007 1.0993 1.0891 1.0960 1.0640 1.0649 1.0663
irintensity: 0.1260 0.3606 0.9153 0.5062 1.0618 0.1435 0.2002 0.6141 0.4958 0.3551 1.7798 0.1267 0.0407 0.9475 1.8343 16.2693 0.0012 43.5749 14.2834 4.9795 5.4141 8.0131 15.5386 4.4555 3.0777 8.6960 15.1095 4.3564 2.7492 1.8672 249.6874 23.9844 4.1787 6.8969 5.1033 55.9857 27.8199 8.2207 11.4916 0.9524 7.5126 4.2861 1.0372 22.8653 19.5692 41.3115 0.2156 4.7823 1.2194 12.9990 0.8598 0.8703 49.4578 2.0723 53.3307 5.1206 9.5200 1.3663 0.7567 12.9118 0.1748 97.8324 17.2291 264.0464 3.5687 0.3933 179.9441 102.5982 25.0327 7.2987 0.3340 22.1868 79.0303 0.2178 0.0128 0.5888 36.3146 0.0618 0.0351 22.6364 8.7915 18.3299 4.8644 5.4718 43.4412 11.1952 14.6644 53.8137 72.9069 0.3617 0.3285 0.1383 0.6163 3.1484 12.2375 2.1192 4.9236 28.7198 6.4221 204.8823 58.4509 176.8247 4.4274 0.7709 3.2169 0.1457 56.7968 151.7757 36.7658 14.5769 0.9807 1.3859 32.9680 1.8496 3.8390 0.6292 0.1753 125.8090 99.2581 101.1576 56.5105 1.7885 5.9514 62.5479 87.5368 12.3255
temp: 298.150 k
press: 1.00000 atm
elementType: 8 8 8 8 6 6 6 6 6 6 6 6 6 6 6 6 6 6 6 6 1 1 1 1 1 1 1 1 1 1 1 1 1 1 1 1 1 1 1 1 1 1 1 1
symmnumber: 1
zpe: 968843.5 jmol-1
zpe.correction: 0.369013 hartree
zpe.thermalcorrener: 0.391647 hartree
zpe.thermalcorrenthalpy: 0.392591 hartree
zpe.thermalcorrgfe: 0.314280 hartree
zpe.sumelectzpe: -923.434347 hartree
zpe.sumelectthermal: -923.411714 hartree
zpe.sumelectthermalent: -923.410769 hartree
zpe.sumelectthermalfe: -923.489080 hartree
dipole: 2.1226 5.0396 1.1805
dipole: 5.5943
quadrupole: -110.4714 -119.6943 -120.4049
quadrupole: 19.0298 6.6958 4.5029
quadrupole: 6.3854 -2.8374 -3.5480 19.0298 6.6958 4.5029
hfenergy: -923.8033602 hartree
pointgroup: C01 [X(C16H24O4)]
dipole: -0.8501308 1.1675958 1.6608041 debye
polarizability: 278.664112|-7.8570683|127.3897159|-5.4907703|24.776009|178.7627058 unknown
InChI: InChI=1S/C16H24O4/c1-2-3-4-5-6-7-8-9-13(17)12-10-11-14(18)16(20)15(12)19/h10-11,18-20H,2-9H2,1H3
charge 0 multiplicity 1
44 atoms
O  -1.316941 -0.687795 -2.391096
O  -2.404824 0.809042 1.5161
O  -5.067683 1.175623 2.104413
O  -7.05693 0.427244 0.227756
C  3.582186 -0.14598 -0.579085
C  4.748293 0.106494 0.40293
C  2.189845 0.076595 0.053342
C  6.141728 -0.096431 -0.234153
C  1.029244 -0.203139 -0.926865
C  7.307342 0.141907 0.752316
C  -0.346689 0.057701 -0.288805
C  8.701348 -0.055064 0.113574
C  -1.518286 -0.241781 -1.219292
C  9.859297 0.182288 1.107261
C  -2.933295 -0.010041 -0.759314
C  -3.328229 0.489019 0.514682
C  -3.976936 -0.330036 -1.680334
C  -4.700908 0.688326 0.799771
C  -5.339725 -0.194867 -1.379113
C  -5.709829 0.304686 -0.108289
H  3.69346 0.51967 -1.460459
H  3.646665 -1.184555 -0.965705
H  4.675354 1.140658 0.800869
H  4.64381 -0.570044 1.277194
H  2.121391 1.12152 0.423663
H  2.086536 -0.575858 0.946196
H  6.250315 0.587412 -1.102057
H  6.211636 -1.127063 -0.641212
H  1.139829 0.424641 -1.832231
H  1.078446 -1.250112 -1.282581
H  7.236438 1.17103 1.163368
H  7.202213 -0.545462 1.617961
H  -0.475397 -0.539831 0.63715
H  -0.430649 1.106915 0.060129
H  8.805823 0.63303 -0.750193
H  8.770507 -1.082652 -0.298548
H  10.844296 0.035035 0.626878
H  9.830166 1.21249 1.510204
H  9.793654 -0.513974 1.964799
H  -3.656367 -0.713864 -2.654316
H  -6.120076 -0.477113 -2.090125
H  -2.91635 0.998235 2.351212
H  -5.181403 2.162183 2.082127
H  -7.133403 0.630113 1.198479
