program: Gaussian 09
title: 000254286
version: EM64L-G09RevD.01
frameworkgroup: C1[X(C9H15Cl3O3)]
method: RPBEPBE
basis: SDD
operation: Freq
keyword: #p
keyword: freq=noraman
keyword: PBEPBE/SDD
title: #p freq=noraman PBEPBE/SDD
converged: YES YES NO NO
title: Mulliken charges:
elementType: Cl Cl Cl O O O C C C C C C C C C H H H H H H H H H H H H H H H
charge: -0.077074 -0.081746 -0.078344 -0.251976 -0.264882 -0.238326 0.082151 0.053155 0.067101 -0.428928 -0.428661 -0.427724 -0.582501 -0.582853 -0.582446 0.227313 0.226498 0.226811 0.240280 0.248877 0.241014 0.249682 0.250153 0.240594 0.273108 0.282244 0.272380 0.288809 0.282094 0.273195
chargesum: 0.00000
title: Mulliken charges with hydrogens summed into heavy atoms:
elementType: Cl Cl Cl O O O C C C C C C C C C
charge: -0.077074 -0.081746 -0.078344 -0.251976 -0.264882 -0.238326 0.309464 0.279653 0.293913 0.060229 0.062034 0.063023 -0.027149 -0.021663 -0.027157
polarizability: 1.35676398e+02 2.88993162e-01 1.19748828e+02 1.68229424e+00 3.26377869e+00 1.32705607e+02
1716.lowfreq: -11.2451 -6.0018 -0.0026 -0.0023 -0.0008 2.5305 20.0007 24.7818 35.4203
frequency: 19.8643 24.7274 35.4084 37.7823 67.3819 82.0759 123.6563 127.2801 149.6388 175.8635 185.2902 188.1353 257.6342 280.3244 324.1229 388.0467 403.7864 421.9693 445.3129 481.8970 503.2634 545.9591 571.6950 600.1145 603.4070 605.5610 685.2302 770.8613 774.4949 798.9445 814.8671 872.9346 892.7511 962.8093 964.8281 971.3671 978.7343 995.4015 1016.1072 1042.9906 1044.8156 1045.6496 1119.9033 1122.9333 1142.0015 1146.3968 1159.6509 1165.2145 1219.8813 1221.0370 1244.0214 1269.4468 1286.1508 1289.7371 1296.9896 1303.7658 1316.4158 1324.5827 1341.6509 1353.5755 1381.9707 1384.8057 1421.3508 1435.0989 1436.4776 1437.2254 1446.8389 1450.3876 1452.3743 2940.3202 2941.5590 2951.4311 3009.4354 3009.6195 3010.2139 3068.5757 3069.0133 3069.6970 3084.9547 3085.2064 3085.5796 3154.2532 3154.7375 3156.0387
redmass: 11.6668 16.9434 5.2249 18.3825 8.4140 6.5327 3.2135 3.0191 7.4837 5.9894 5.3668 2.7001 2.5989 2.4716 2.9052 3.5640 3.4021 5.4503 3.6194 3.5687 3.0095 3.3153 3.7869 4.9763 5.1267 5.3655 6.3202 4.5101 3.0256 2.2268 1.7988 1.9003 2.5746 1.9369 3.2268 2.6426 3.4320 2.2083 2.9728 2.2682 2.2633 1.8587 2.0423 2.2931 1.5721 1.2527 1.2922 1.3483 1.3132 1.3289 1.3875 1.0770 1.1881 1.2040 1.1928 1.1510 1.2110 1.2636 1.2573 1.2678 1.6793 1.6503 1.9045 1.0914 1.0977 1.1142 1.0957 1.0974 1.1151 1.0842 1.0843 1.0840 1.0625 1.0623 1.0624 1.0606 1.0606 1.0607 1.0952 1.0951 1.0954 1.1114 1.1114 1.1115
irintensity: 0.8485 0.4457 0.1499 0.0332 4.7928 8.8206 3.5602 1.2900 0.8821 1.8385 4.9211 4.2665 2.2874 4.2657 2.5741 5.8907 14.3000 20.3895 5.1496 6.5543 1.6868 5.7481 6.0646 29.4079 23.6334 4.0454 9.9092 4.5467 7.3090 9.1587 11.5972 28.0175 94.4098 0.3791 24.4968 53.0767 116.1351 92.0573 139.6978 84.4601 36.3224 63.4337 28.3218 34.8924 13.4343 2.6689 18.4152 32.0993 1.2883 0.8345 2.1807 0.0810 8.9398 17.3535 44.7643 1.3346 11.7946 1.0641 25.5892 26.6002 24.1059 6.8285 4.5425 6.8386 11.6643 33.1261 2.7713 22.3155 15.9763 2.7313 4.1008 79.8443 5.0371 4.5813 12.7147 10.4167 22.3259 14.9996 4.4731 17.0503 14.2021 12.3912 7.1564 8.9725
temp: 298.150 k
press: 1.00000 atm
elementType: 17 17 17 8 8 8 6 6 6 6 6 6 6 6 6 1 1 1 1 1 1 1 1 1 1 1 1 1 1 1
symmnumber: 1
zpe: 617533.3 jmol-1
zpe.correction: 0.235206 hartree
zpe.thermalcorrener: 0.251922 hartree
zpe.thermalcorrenthalpy: 0.252866 hartree
zpe.thermalcorrgfe: 0.186597 hartree
zpe.sumelectzpe: -1956.593335 hartree
zpe.sumelectthermal: -1956.576619 hartree
zpe.sumelectthermalent: -1956.575675 hartree
zpe.sumelectthermalfe: -1956.641944 hartree
dipole: -0.1543 -0.3762 -4.3403
dipole: 4.3593
quadrupole: -113.5040 -111.6492 -113.1992
quadrupole: -0.0857 -2.1748 -2.6452
quadrupole: -0.7199 1.1349 -0.4151 -0.0857 -2.1748 -2.6452
hfenergy: -1956.8285412 hartree
pointgroup: C01 [X(C9H15Cl3O3)]
dipole: -0.071935 -0.1516856 -1.7068323 debye
polarizability: 135.6993462|0.0406694|119.7615643|1.721834|3.2703802|132.6699225 unknown
InChI: InChI=1S/C9H15Cl3O3/c10-4-1-7-13-8(2-5-11)15-9(14-7)3-6-12/h7-9H,1-6H2
charge 0 multiplicity 1
30 atoms
Cl 1.807913 3.530909 1.297041
Cl -4.2893 -0.141856 1.794232
Cl 3.465039 -2.137354 1.651568
O  -1.244547 0.688997 -0.6160
O  1.090266 0.106812 -0.653925
O  -0.577572 -1.622667 -0.462484
C  0.101516 1.105245 -0.20923
C  -1.556138 -0.622628 -0.019283
C  0.770831 -1.203523 -0.060169
C  0.412809 2.424476 -0.899972
C  -2.928251 -1.055872 -0.511337
C  1.757292 -2.226798 -0.601842
C  1.777488 2.996273 -0.52525
C  -4.046383 -0.10587 -0.090304
C  3.205813 -1.935643 -0.219432
H  0.14376 1.17477 0.901978
H  -1.50252 -0.525593 1.089601
H  0.807487 -1.107195 1.049384
H  0.394984 2.243301 -1.992306
H  -0.389896 3.144581 -0.664994
H  -2.893665 -1.0880 -1.617716
H  -3.125996 -2.080158 -0.151079
H  1.454164 -3.228594 -0.25166
H  1.676753 -2.217588 -1.70631
H  2.010545 3.910081 -1.089828
H  2.581846 2.253756 -0.622586
H  -5.019425 -0.405587 -0.504244
H  -3.81692 0.941312 -0.331784
H  3.497186 -0.899433 -0.441193
H  3.903725 -2.650254 -0.678076
