program: Gaussian 09
title: 000254272
version: EM64L-G09RevD.01
frameworkgroup: C1[X(C7H13NO3)]
method: RPBEPBE
basis: SDD
operation: Freq
keyword: #p
keyword: freq=noraman
keyword: PBEPBE/SDD
title: #p freq=noraman PBEPBE/SDD
converged: YES YES NO NO
title: Mulliken charges:
elementType: O O O N C C C C C C C H H H H H H H H H H H H H
charge: -0.284548 -0.425390 -0.214598 -0.008699 -0.039041 -0.408476 -0.687415 0.155740 0.202555 -0.757368 -0.738695 0.259366 0.226765 0.224466 0.213023 0.223748 0.239334 0.233087 0.227721 0.249831 0.264395 0.220710 0.246167 0.377323
chargesum: 0.00000
title: Mulliken charges with hydrogens summed into heavy atoms:
elementType: O O O N C C C C C C C
charge: -0.284548 -0.048067 -0.214598 -0.008699 0.220325 0.042755 -0.011310 0.155740 0.202555 -0.046729 -0.007424
polarizability: 1.24359467e+02 -1.75001664e-01 8.70372145e+01 -8.59688618e+00 1.28148302e+00 7.84162332e+01
1716.lowfreq: -6.6694 -4.3902 0.0010 0.0011 0.0012 5.4571 29.4642 47.9312 56.0694
frequency: 28.9553 47.8972 56.0549 73.5422 90.6924 109.0695 168.3516 190.4756 208.8474 233.0692 276.8382 283.6614 324.4265 373.6726 438.5399 468.3282 494.8825 560.1332 577.1161 637.6634 700.8264 763.5600 809.2282 844.3535 866.5137 909.4598 956.0451 967.6917 973.1615 1024.4816 1058.6153 1069.3777 1084.0864 1099.6551 1141.9439 1240.1779 1257.6462 1269.2276 1286.2477 1329.6586 1357.4283 1381.3436 1392.4679 1395.7967 1451.4213 1453.8679 1455.7018 1461.2292 1468.1700 1474.4188 1485.3723 1614.5261 1679.3661 2976.6276 2987.8466 2990.1387 3003.9072 3024.1266 3055.1865 3060.1566 3069.9580 3083.0082 3100.6593 3107.6419 3111.7481 3514.4161
redmass: 3.3008 4.9197 5.7650 2.5435 1.1068 3.1654 1.5139 1.2204 2.3263 2.7463 2.9347 2.7627 4.2668 2.7607 3.9378 3.0753 3.5847 3.8798 1.7870 2.4700 4.0817 1.4858 3.5418 2.8116 6.1530 2.4190 1.2820 1.7828 1.7624 2.5501 1.7219 1.7080 1.6621 2.9894 1.9556 1.4830 1.5901 1.3672 2.7686 1.4608 1.5204 1.2353 1.2358 1.2155 1.1061 1.0540 1.0796 1.0498 1.0678 1.0413 1.0515 6.1945 9.1497 1.0369 1.0365 1.0361 1.0626 1.0817 1.0976 1.1009 1.0958 1.1002 1.1003 1.1008 1.0991 1.0641
irintensity: 1.8074 2.3029 1.9435 0.4073 1.1035 1.0410 0.6862 0.6394 0.8832 1.1647 1.2786 1.8493 0.9239 7.7518 19.6600 6.4513 4.4437 20.4658 67.5604 71.6617 22.7322 21.5430 19.3442 4.7842 92.6991 15.7017 4.3999 115.4118 46.5497 269.2353 31.1752 5.5271 5.3280 9.5371 2.8324 7.9161 7.5320 12.4566 8.8530 7.6054 6.5315 44.0407 10.8549 18.7969 20.8890 15.8440 12.6187 11.7128 4.8875 8.7953 9.4532 6.7705 183.0206 23.3420 16.4930 26.0611 11.9742 29.1646 17.7223 6.1002 11.1556 46.6512 39.6796 10.6677 24.3142 20.2892
temp: 298.150 k
press: 1.00000 atm
elementType: 8 8 8 7 6 6 6 6 6 6 6 1 1 1 1 1 1 1 1 1 1 1 1 1
symmnumber: 1
zpe: 511108.7 jmol-1
zpe.correction: 0.194671 hartree
zpe.thermalcorrener: 0.208298 hartree
zpe.thermalcorrenthalpy: 0.209242 hartree
zpe.thermalcorrgfe: 0.153105 hartree
zpe.sumelectzpe: -554.040436 hartree
zpe.sumelectthermal: -554.026809 hartree
zpe.sumelectthermalent: -554.025865 hartree
zpe.sumelectthermalfe: -554.082002 hartree
dipole: -0.3093 0.5504 -0.5414
dipole: 0.8317
quadrupole: -52.4761 -62.3695 -69.9531
quadrupole: -2.6276 -0.5600 -0.5486
quadrupole: 9.1234 -0.7699 -8.3535 -2.6276 -0.5600 -0.5486
hfenergy: -554.2351073 hartree
pointgroup: C01 [X(C7H13N1O3)]
dipole: -0.1181282 -0.2236527 0.2075822 debye
dipolederiv: -1.3826575 0.0514954 -0.0653153 0.6289982 -0.3812415 0.0663116 0.1493486 -0.0410132 -0.2317437 -0.9473077 -0.3615648 -0.2530386 -0.4806121 -0.6729025 -0.2778951 -0.1684813 -0.2100116 -0.3819348 -0.5577501 -0.1692002 -0.1255942 -0.0744775 -0.4835579 0.1958249 -0.2891779 0.0593552 -0.796104 0.4329012 -0.1336092 0.0088303 -0.7183352 -0.1405587 -0.0874442 -0.288113 -0.0241304 -0.2147702 0.9925787 0.0967745 -0.0190014 0.2994398 0.0950176 0.0601917 0.1885545 0.0868187 0.1764079 0.0206298 -0.0764735 0.0419839 -0.0350008 0.1462844 -0.0051498 -0.007442 0.0271455 0.0838505 0.0476062 0.0232265 -0.0014659 0.0413571 0.0084988 -0.0491208 -0.0178993 -0.058949 -0.0372105 0.9294454 0.6040256 0.3922404 0.5384287 0.8543832 -0.1036032 0.4325151 -0.0833588 0.9508572 0.2294986 -0.0534277 0.0283045 0.00384 0.3225989 0.2066884 0.0738018 0.2034022 0.1158743 -0.1564982 0.1032947 0.0115085 0.0090345 -0.0346526 -0.0583294 -0.0456381 -0.0474123 0.0395264 0.0419013 0.0543082 0.0544928 -0.0004915 -0.2007213 -0.1760871 0.0268569 -0.1473416 -0.0156742 0.0085273 0.0073483 0.0256565 -0.0743106 0.0117173 -0.0751193 -0.0374733 -0.0575198 -0.0597298 0.0871461 -0.0199539 0.0655608 -0.0139209 -0.0586597 0.1110451 0.073041 0.0732972 -0.063232 -0.113981 -0.0454277 -0.0682808 -0.0481471 0.040302 -0.0713753 -0.0393584 -0.0536289 0.0435006 -0.0400463 0.1585981 0.0003785 0.1560984 -0.0782563 -0.0061442 -0.0101113 0.0091364 0.0799446 0.063582 -0.0572381 0.0566444 -0.0838414 -0.0119548 0.1123775 0.0609518 0.0754413 -0.0457648 -0.0473193 -0.1048986 -0.0778231 -0.0876108 0.0788471 -0.0306596 -0.0675476 -0.0278991 0.0461599 0.0130985 0.0451188 -0.053049 0.0883112 0.0807004 0.0416054 -0.0880831 0.0752764 -0.073168 -0.0895848 -0.0501881 0.0722233 -0.0668966 0.0200196 0.0739146 0.1079211 0.0413616 0.0730241 0.1088591 -0.0665147 -0.0494456 -0.0084082 -0.0261238 -0.0989401 -0.0112016 -0.1105649 0.0430652 0.0432006 0.0037511 0.1138273 -0.008913 0.0950189 0.0029655 0.0584199 -0.0291211 0.0059525 -0.1322766 -0.0199853 -0.1025066 0.0107292 0.0996064 0.0067038 -0.0971399 -0.0175716 0.0700605 0.1070675 0.0235782 -0.0397377 -0.0246041 -0.0390946 0.0511698 -0.0202514 0.1001316 0.0244108 0.3413793 -0.0130376 -0.016393 -0.0506673 0.2747293 0.1110699 0.0165075 0.1571565 0.1666976 unknown
polarizability: 124.68385|-0.1906688|86.9363518|7.679272|1.5669529|78.1927126 unknown
InChI: InChI=1S/C7H13NO3/c1-4-6(7(9)10)11-8-5(2)3/h6,9H,4H2,1-3H3
charge 0 multiplicity 1
24 atoms
O  -0.234854 -0.684078 0.292095
O  2.509457 1.753965 0.216265
O  0.9761 1.22757 -1.451554
N  -1.290989 0.313258 0.614628
C  1.048504 -0.096707 0.670071
C  2.087068 -1.24305 0.703071
C  2.284248 -1.951733 -0.653683
C  1.451293 1.000402 -0.323264
C  -2.437408 -0.059202 0.091165
C  -3.612396 0.850646 0.373751
C  -2.634773 -1.29853 -0.753958
H  0.964411 0.369389 1.669829
H  1.740983 -1.968843 1.462398
H  3.042892 -0.818691 1.062126
H  3.000596 -2.786035 -0.549059
H  2.679024 -1.261515 -1.421367
H  1.328368 -2.357366 -1.026086
H  -4.031758 1.240702 -0.573178
H  -4.420508 0.292939 0.884613
H  -3.308777 1.700432 1.005884
H  -1.87601 -1.334628 -1.556234
H  -3.644028 -1.318347 -1.195794
H  -2.492025 -2.212667 -0.147421
H  2.780783 2.453491 -0.437996
