program: Gaussian 09
title: 000250319
version: EM64L-G09RevD.01
frameworkgroup: C1[X(C24H30N2S4)]
method: RPBEPBE
basis: SDD
operation: Freq
keyword: #p
keyword: freq=noraman
keyword: PBEPBE/SDD
title: #p freq=noraman PBEPBE/SDD
converged: YES YES NO NO
title: Mulliken charges:
elementType: S S S S N N C C C C C C C C C C C C C C C C C C C C C C C C H H H H H H H H H H H H H H H H H H H H H H H H H H H H H H
charge: 0.096162 0.071901 0.069173 0.099319 -0.084616 -0.083745 -0.542487 -0.543610 -0.316322 -0.376912 -0.386217 -0.306629 -0.356520 -0.359896 -0.363953 -0.355322 -0.485468 -0.484607 0.450162 0.447532 -0.375857 -0.376000 -0.449022 -0.449996 -0.228154 -0.228690 -0.220689 -0.220440 -0.245152 -0.245272 0.250198 0.238110 0.245900 0.238714 0.241815 0.249017 0.234962 0.248023 0.237241 0.208256 0.198308 0.215863 0.240154 0.207576 0.200227 0.213506 0.220440 0.198568 0.223085 0.196955 0.261875 0.262490 0.232546 0.233098 0.224882 0.225101 0.224693 0.224836 0.227326 0.227560
chargesum: 0.00000
title: Mulliken charges with hydrogens summed into heavy atoms:
elementType: S S S S N N C C C C C C C C C C C C C C C C C C C C C C C C
charge: 0.096162 0.071901 0.069173 0.099319 -0.084616 -0.083745 -0.542487 -0.543610 0.171987 0.107702 0.104615 0.176356 0.088977 0.054276 0.083777 0.058412 -0.066460 -0.064567 0.450162 0.447532 -0.113983 -0.113510 -0.216477 -0.216898 -0.003272 -0.003589 0.004004 0.004396 -0.017826 -0.017712
polarizability: 4.74850724e+02 2.43876631e+01 2.77317709e+02 4.77760170e+00 -5.91329152e+00 2.96751158e+02
1716.lowfreq: -4.3343 -0.0015 -0.0012 0.0009 0.1013 8.2370 15.1333 17.0557 27.2679
frequency: 14.8219 16.5532 27.2254 30.7263 32.6699 39.7126 51.4221 64.7232 70.2961 106.6651 121.2079 146.2711 148.5211 162.9198 186.4717 195.6883 205.2284 213.3095 218.9637 228.5020 248.9810 265.3612 293.5833 303.2017 306.3499 312.4114 317.4959 324.7756 340.5101 362.3344 371.3328 373.8883 389.0580 406.2889 406.6161 424.0886 427.7789 458.9715 463.3641 467.7568 477.2974 479.5495 499.7006 502.8861 553.9043 556.3127 599.9487 600.1665 616.8440 616.9676 704.8334 704.9913 719.0478 723.1833 741.3699 742.7853 775.8280 776.7221 807.4073 808.6682 809.7708 810.8035 859.3133 860.3152 861.1103 864.2169 913.5581 913.6758 936.2937 936.6879 982.3218 982.9460 989.4059 989.6332 990.2513 991.4361 994.8943 995.0817 1005.8774 1006.3990 1016.2738 1016.3984 1025.9246 1025.9457 1032.7928 1033.5723 1075.0603 1075.7628 1090.9956 1096.1231 1127.7391 1129.3388 1130.8413 1132.1924 1165.2245 1167.1784 1170.2295 1170.3828 1180.1608 1180.4344 1181.3492 1181.8444 1210.8338 1211.6853 1223.3017 1224.0432 1251.8604 1253.4226 1273.0029 1273.4437 1291.5096 1293.3008 1309.2466 1309.8817 1316.8837 1317.8489 1330.2712 1334.1510 1337.8458 1339.2448 1358.8643 1360.5874 1379.2166 1379.5146 1394.6102 1395.0395 1435.2612 1435.2913 1440.3928 1440.7054 1446.0804 1446.2992 1457.8365 1458.8354 1466.8110 1467.2510 1478.1845 1478.5545 1483.4010 1483.5132 1594.1893 1594.6719 1614.6490 1614.7011 2850.0744 2852.4326 2861.0787 2861.4367 2882.0445 2882.4814 2985.4223 2988.7502 2988.9291 2989.5893 3002.6463 3004.3154 3025.6831 3028.3796 3044.8723 3049.7470 3055.8792 3056.4085 3068.4148 3069.1586 3113.1414 3113.1431 3122.8775 3122.9371 3135.7580 3135.9427 3146.9513 3147.1086 3161.5560 3161.7194
redmass: 6.4115 5.7587 5.1053 3.7936 4.4790 5.0774 5.6149 5.6538 5.4751 5.9043 4.7543 3.8717 4.5517 4.9403 4.8071 4.6023 4.5327 4.7359 4.8641 5.9431 3.3205 3.8944 4.9792 2.9635 2.6279 3.4553 2.9490 2.6231 3.0024 4.1313 2.6747 2.0556 3.4021 2.8466 2.8547 10.6602 4.9093 3.7299 3.2230 6.8067 3.3125 3.4746 3.8468 3.9718 3.4458 3.3211 4.4387 4.3956 6.3694 6.3668 2.2471 2.2777 2.9863 2.7903 1.6615 1.6811 2.8374 2.8331 2.6852 3.6011 1.5913 1.8538 1.2591 1.2583 3.4981 3.6848 1.4485 1.4453 1.9497 1.9499 1.3962 1.3889 3.4496 4.7597 3.1462 2.5240 1.5304 1.5056 1.6295 1.6042 1.7536 1.7509 2.1216 2.1162 2.4207 2.4284 1.7513 1.6892 2.0826 2.1755 2.5286 3.3763 3.4354 2.6005 2.2349 2.3603 1.0634 1.0655 1.1160 1.1114 1.1232 1.1373 2.4802 2.5464 1.3191 1.3160 1.2578 1.2695 1.4514 1.4360 1.4157 1.4100 1.3110 1.3241 1.3953 1.4013 1.3501 1.3454 1.3283 1.3636 1.4314 1.4359 2.8881 2.9694 1.9913 1.9565 1.0810 1.0817 2.0906 2.0890 1.0854 1.0847 1.0934 1.0909 1.1218 1.1200 1.1943 1.2122 1.8339 1.8689 6.1483 6.1608 6.1347 6.1434 1.0704 1.0711 1.0705 1.0707 1.0693 1.0697 1.0866 1.0654 1.0763 1.0643 1.0616 1.0604 1.0878 1.0879 1.0885 1.0890 1.1024 1.1022 1.1024 1.1022 1.0870 1.0869 1.0862 1.0862 1.0914 1.0914 1.0956 1.0956 1.1014 1.1014
irintensity: 0.0722 0.0266 0.0076 0.0556 0.3822 0.0631 0.0387 0.2457 0.0218 0.0049 2.0486 1.4177 1.2923 0.0819 2.2994 5.7022 0.2716 0.3801 0.8219 6.8502 0.6401 5.2578 2.3076 0.7236 0.6461 3.6224 0.5925 4.8969 0.3235 0.7848 0.0498 3.8134 0.2337 0.4496 0.3658 0.9158 2.2215 14.9530 4.4552 5.2870 4.1192 4.7881 4.4923 0.7373 4.8993 0.2175 0.9498 4.8720 0.0815 0.1000 32.3501 32.6892 9.4577 47.9386 49.7690 42.9404 8.1262 34.1054 5.7947 3.3875 0.8946 1.6602 0.4957 0.4541 0.0099 4.1630 18.2818 1.2256 0.8462 3.6315 3.2574 2.4941 58.5527 0.5760 87.8535 8.9203 8.9191 0.9173 6.8568 5.1692 1.4412 0.0668 10.5285 6.0613 6.4814 32.2299 1.6898 46.3078 0.3442 24.8223 12.6819 17.2708 1.4055 53.7359 6.4496 2.2549 0.8322 0.3770 4.5544 1.2122 4.4658 4.0985 3.8664 3.0050 8.6375 6.3064 4.5366 25.4084 20.2404 18.5474 59.6466 5.1197 7.6996 11.1822 8.4786 14.4027 7.3417 45.1831 12.3477 5.5818 4.3602 15.2424 1.8737 8.3456 1.0824 3.0050 4.1184 22.7288 13.1071 13.4831 0.8907 18.1226 6.9102 2.3109 10.6849 9.0719 15.4266 10.5929 16.9855 8.4192 1.1674 1.1811 9.8727 5.4428 54.7536 59.0771 8.9630 147.8096 38.9232 124.0706 22.2236 24.2993 8.2280 1.8503 3.7148 5.5219 53.5892 43.7401 25.7308 21.3194 16.9137 8.2329 7.9880 2.6801 7.0123 9.4056 0.0772 0.1790 18.1023 18.1920 34.6714 34.6016 29.8842 28.8225
temp: 298.150 k
press: 1.00000 atm
elementType: 16 16 16 16 7 7 6 6 6 6 6 6 6 6 6 6 6 6 6 6 6 6 6 6 6 6 6 6 6 6 1 1 1 1 1 1 1 1 1 1 1 1 1 1 1 1 1 1 1 1 1 1 1 1 1 1 1 1 1 1
symmnumber: 1
zpe: 1284605.9 jmol-1
zpe.correction: 0.489281 hartree
zpe.thermalcorrener: 0.518277 hartree
zpe.thermalcorrenthalpy: 0.519221 hartree
zpe.thermalcorrgfe: 0.426720 hartree
zpe.sumelectzpe: -2632.052625 hartree
zpe.sumelectthermal: -2632.023629 hartree
zpe.sumelectthermalent: -2632.022685 hartree
zpe.sumelectthermalfe: -2632.115186 hartree
dipole: -0.0290 -0.2785 -0.0172
dipole: 0.2806
quadrupole: -194.1324 -201.7956 -206.3815
quadrupole: 4.3220 6.0990 -0.2939
quadrupole: 6.6374 -1.0258 -5.6117 4.3220 6.0990 -0.2939
hfenergy: -2632.5419058 hartree
pointgroup: C01 [X(C24H30N2S4)]
dipole: 0.0110977 0.109828 0.0000477 debye
polarizability: 474.4205521|25.3393145|276.7827244|-7.7716503|3.9479839|297.7163143 unknown
InChI: InChI=1S/C24H30N2S4/c1-3-7-21(8-4-1)19-25-15-11-23(12-16-25)27-29-24(30-28-23)13-17-26(18-14-24)20-22-9-5-2-6-10-22/h1-10H,11-20H2
charge 0 multiplicity 1
60 atoms
S  0.57021 1.727129 1.629913
S  -0.804363 -0.070114 1.467951
S  1.032614 1.669551 -1.466118
S  -0.342137 -0.127155 -1.630025
N  4.721792 0.984774 -0.283312
N  -4.494964 0.596438 0.281611
C  1.861888 1.394651 0.249119
C  -1.633298 0.198866 -0.248116
C  2.524006 0.018447 0.384871
C  2.89918 2.537152 0.39527
C  -2.664304 -0.949371 -0.393704
C  -2.302257 1.571798 -0.384549
C  3.753289 -0.113067 -0.535785
C  4.116284 2.31114 -0.53153
C  -3.88399 -0.728988 0.529518
C  -3.532163 1.697081 0.537514
C  6.000204 0.798204 -1.011492
C  -5.774746 0.778811 1.008624
C  6.817948 -0.380515 -0.490329
C  -6.891683 -0.121449 0.487543
C  6.916807 -0.627742 0.902608
C  -7.05922 -0.324253 -0.906203
C  7.528009 -1.216792 -1.385888
C  -7.804384 -0.731558 1.382255
C  7.713436 -1.687334 1.388762
C  -8.12054 -1.117558 -1.393908
C  8.330398 -2.276354 -0.902067
C  -8.871249 -1.523406 0.89687
C  8.426226 -2.514541 0.487942
C  -9.033046 -1.718473 -0.493744
H  1.792961 -0.780118 0.16373
H  2.846925 -0.096077 1.436799
H  3.248931 2.538074 1.446126
H  2.436891 3.519827 0.183962
H  -2.19676 -1.928725 -0.17923
H  -3.012393 -0.956627 -1.44512
H  -2.628043 1.68136 -1.436118
H  -1.574576 2.374247 -0.165661
H  4.253944 -1.075064 -0.328757
H  3.425069 -0.124046 -1.604622
H  3.796234 2.432765 -1.597764
H  4.871061 3.091661 -0.319618
H  -4.635419 -1.51008 0.317827
H  -3.571486 -0.842217 1.598743
H  -3.197655 1.713874 1.604354
H  -4.036031 2.659292 0.328712
H  6.586292 1.730742 -0.880226
H  5.841205 0.676094 -2.113268
H  -6.072025 1.838775 0.874639
H  -5.658451 0.620165 2.111143
H  6.349267 0.011922 1.587902
H  -6.338682 0.137229 -1.590898
H  7.450482 -1.041401 -2.466543
H  -7.67923 -0.589328 2.463326
H  7.780076 -1.869439 2.467689
H  -8.238922 -1.267143 -2.473409
H  8.873104 -2.916315 -1.607211
H  -9.569291 -1.990119 1.601322
H  9.044679 -3.336972 0.865016
H  -9.8574 -2.333731 -0.871851
