program: Gaussian 09
title: 000250314
version: EM64L-G09RevD.01
frameworkgroup: C1[X(C16H15NO4S)]
method: RPBEPBE
basis: SDD
operation: Freq
keyword: #p
keyword: freq=noraman
keyword: PBEPBE/SDD
title: #p freq=noraman PBEPBE/SDD
converged: YES YES NO NO
title: Mulliken charges:
elementType: S O O O O N C C C C C C C C C C C C C C C C H H H H H H H H H H H H H H H
charge: 1.017369 -0.271489 -0.233361 -0.546654 -0.538088 -0.575773 -0.326620 -0.216627 0.191800 0.369365 0.192813 0.242780 -0.397239 -0.390535 -0.345771 -0.369157 -0.725745 -0.249952 -0.196049 -0.244195 -0.222770 -0.239001 0.334808 0.250218 0.346575 0.285179 0.266905 0.275760 0.257415 0.278933 0.322739 0.279903 0.238777 0.237560 0.238461 0.228966 0.232700
chargesum: 0.00000
title: Mulliken charges with hydrogens summed into heavy atoms:
elementType: S O O O O N C C C C C C C C C C C C C C C C
charge: 1.017369 -0.271489 -0.233361 -0.546654 -0.538088 -0.229198 0.008188 0.033590 0.191800 0.369365 0.192813 0.242780 -0.112060 -0.123630 -0.070011 -0.111743 0.155831 -0.011175 0.041510 -0.005734 0.006196 -0.006301
polarizability: 2.87596033e+02 2.96093244e+00 2.33249338e+02 -5.94305089e+00 -2.84809912e+01 1.33400571e+02
1716.lowfreq: -7.9964 -5.4380 -0.0011 -0.0009 0.0012 5.6676 17.8885 40.7958 49.7320
frequency: 16.9079 40.7201 49.7234 62.3689 64.7889 102.1657 119.7219 140.8052 150.0963 160.9162 180.4773 202.7833 232.3226 248.0569 254.0343 276.3327 282.8330 304.2033 330.3514 339.2200 364.0819 404.3051 415.4781 431.7243 449.0075 473.9961 510.5703 523.9183 557.7237 569.9591 581.1685 616.5251 643.4643 673.4074 695.9250 710.9355 728.0790 746.4821 768.5564 795.0831 802.3707 809.0936 823.0448 843.0600 866.3561 882.1832 892.4896 905.3536 942.5673 973.5433 988.0663 992.3140 996.8032 998.4656 1003.3315 1009.1932 1019.1823 1031.2028 1043.5193 1056.5153 1076.5713 1103.2852 1114.5150 1165.4541 1175.6305 1198.5507 1204.8965 1206.4766 1224.1467 1260.9542 1268.6160 1299.4205 1312.4382 1319.0605 1323.4068 1334.6791 1354.9822 1381.8866 1396.2251 1414.2630 1427.9211 1436.7672 1450.6642 1461.0419 1489.3003 1570.0823 1583.7395 1592.3931 1615.2119 1618.3685 2938.1923 2948.6384 3016.1423 3122.5023 3131.2517 3139.2048 3146.1967 3150.7885 3162.7406 3163.2374 3166.0704 3176.3831 3176.7988 3189.0317 3360.8605
redmass: 5.9240 5.5060 5.3310 5.6994 5.2775 5.0194 5.3112 5.3235 8.3410 7.3775 4.0859 1.1064 4.6932 5.4400 5.1607 5.4898 4.9982 5.5578 8.2444 5.1186 8.4133 2.9189 4.3610 3.8795 5.4024 4.3890 5.3108 3.4537 7.9916 5.1000 5.4127 6.4183 5.7335 3.7792 3.7858 1.9093 3.9432 1.8875 1.6608 2.7754 9.2877 3.6996 5.1861 3.3831 1.2546 1.5793 4.0678 3.8947 1.4692 1.3745 3.0053 1.9418 1.5480 1.5162 1.4209 1.6773 2.6289 2.2289 1.8779 2.4660 2.5473 2.0257 2.1138 1.1447 1.0563 1.4587 2.0726 1.4762 1.5812 1.3921 1.3563 1.7459 1.5420 1.3949 1.3099 1.3384 1.2832 6.7737 10.0888 1.0487 1.0532 2.2382 2.7305 2.5721 2.2104 7.5253 9.1762 6.0026 5.8364 7.0147 1.0822 1.0828 1.0259 1.0896 1.0873 1.0863 1.0927 1.0900 1.1072 1.0979 1.0951 1.1001 1.0969 1.1079 1.0750
irintensity: 0.0496 0.1620 2.8974 2.5657 3.7335 1.1698 10.1717 4.8093 2.7840 0.1252 5.1976 0.9218 1.3723 1.1391 2.0199 8.4037 10.4853 1.5351 9.9051 18.2535 24.0557 1.2784 49.6341 12.4677 9.1230 18.9701 11.5134 9.2245 1.2164 12.8247 39.0649 0.5772 3.9641 19.1538 10.7986 26.4501 7.8319 104.8015 128.9344 9.3547 69.7274 57.8204 18.1992 23.3008 0.8431 0.3756 24.1062 34.1612 11.4155 2.9667 0.7626 15.9579 25.6777 39.3098 12.6592 10.8424 6.6607 7.0510 33.4106 32.0173 3.2028 6.4812 47.9003 14.9333 1.1549 0.8221 108.7073 1.3676 25.8386 53.1284 20.7049 120.8767 21.3917 27.2362 10.0488 2.3185 16.1276 3.1389 16.6121 11.6675 25.1913 12.1000 134.5096 23.5711 18.2231 35.8750 225.3523 0.9184 1.4334 106.4377 9.2271 31.4951 12.1108 4.0956 3.7687 3.8151 13.2777 3.1558 8.4263 28.9502 11.4711 17.8209 12.0875 0.7492 28.8279
temp: 298.150 k
press: 1.00000 atm
elementType: 16 8 8 8 8 7 6 6 6 6 6 6 6 6 6 6 6 6 6 6 6 6 1 1 1 1 1 1 1 1 1 1 1 1 1 1 1
symmnumber: 1
zpe: 726533.2 jmol-1
zpe.correction: 0.276722 hartree
zpe.thermalcorrener: 0.296795 hartree
zpe.thermalcorrenthalpy: 0.297740 hartree
zpe.thermalcorrgfe: 0.227013 hartree
zpe.sumelectzpe: -1370.654236 hartree
zpe.sumelectthermal: -1370.634162 hartree
zpe.sumelectthermalent: -1370.633218 hartree
zpe.sumelectthermalfe: -1370.703944 hartree
dipole: -3.9817 -2.3884 0.3508
dipole: 4.6563
quadrupole: -127.6412 -122.8014 -143.9373
quadrupole: -4.5754 -5.7180 -0.2982
quadrupole: 3.8188 8.6586 -12.4773 -4.5754 -5.7180 -0.2982
hfenergy: -1370.9309574 hartree
pointgroup: C01 [X(C16H15N1O4S1)]
dipole: 1.4523104 1.053046 0.3713376 debye
polarizability: 286.0042977|6.2434571|221.6643072|9.0453023|44.5135731|146.5773371 unknown
InChI: InChI=1S/C16H15NO4S/c1-22(19,20)17-14-15(18)12-9-5-6-10-13(12)21-16(14)11-7-3-2-4-8-11/h2-10,14,16-17H,1H3
charge 0 multiplicity 1
37 atoms
S  -1.595471 -2.857011 -0.103544
O  0.735058 1.396567 0.556152
O  1.823872 -2.088039 -1.505556
O  -2.148993 -2.545267 -1.612968
O  -2.617593 -3.097121 1.134659
N  -0.443874 -1.454709 0.430741
C  0.02935 -0.63711 -0.719244
C  -0.154994 0.883883 -0.531082
C  1.519453 -1.006798 -0.916948
C  -1.57162 1.35523 -0.218289
C  2.509675 -0.104328 -0.300643
C  2.079208 1.029307 0.452715
C  -2.6935 0.698068 -0.78733
C  -1.776418 2.499248 0.593864
C  3.900085 -0.405598 -0.3556
C  3.012452 1.819727 1.162272
C  -0.340102 -4.27132 -0.237113
C  4.832813 0.387632 0.328752
C  4.380646 1.496597 1.096901
C  -3.99778 1.184225 -0.546602
C  -3.082694 2.979308 0.832907
C  -4.198456 2.325962 0.261233
H  -0.51534 -0.941368 -1.639984
H  0.206517 1.360294 -1.470213
H  -0.993362 -0.913816 1.127643
H  -2.573249 -0.199064 -1.40616
H  -0.913369 2.999115 1.041423
H  4.206896 -1.283269 -0.934313
H  2.652334 2.67532 1.740966
H  0.018384 -4.446436 0.785668
H  0.451618 -3.896056 -0.903756
H  -0.895044 -5.124098 -0.652089
H  5.900593 0.152458 0.282251
H  5.104107 2.114169 1.640406
H  -4.854149 0.660899 -0.984961
H  -3.227956 3.862329 1.465135
H  -5.211798 2.698269 0.447805
