program: Gaussian 09
title: 000254260
version: EM64L-G09RevD.01
frameworkgroup: C1[X(C10H15N)]
method: RPBEPBE
basis: SDD
operation: Freq
keyword: #pfreq=noraman
keyword: PBEPBE/SDD
title: #p freq=noraman PBEPBE/SDD
converged: YES YES NO NO
title: Mulliken charges:
elementType: N C C C C C C C C C C H H H H H H H H H H H H H H H
charge: -0.475903 0.290969 -0.755357 -0.687938 -0.686447 0.489445 -0.347119 -0.448371 -0.242534 -0.197196 -0.279344 0.292564 0.220047 0.225760 0.220706 0.231046 0.218606 0.204618 0.219030 0.204489 0.229560 0.210592 0.206634 0.215381 0.217604 0.223159
chargesum: 0.00000
title: Mulliken charges with hydrogens summed into heavy atoms:
elementType: N C C C C C C C C C C
charge: -0.183340 0.290969 -0.088845 -0.033668 -0.033369 0.489445 -0.136527 -0.241737 -0.027153 0.020408 -0.056185
polarizability: 1.60746831e+02 2.25666534e+00 1.13261489e+02 -3.63995901e-02 2.12236791e-03 7.16134258e+01
1716.lowfreq: -8.3973 -0.0006 -0.0004 -0.0004 9.2118 12.4449 50.1218 82.3134 142.7281
frequency: 49.9235 82.1693 142.7110 146.0896 204.5214 216.2357 252.0376 284.6396 301.1446 338.9124 361.6349 384.5658 414.4847 444.3708 482.1138 514.1427 609.0853 616.5187 693.3017 743.1898 751.6945 813.8817 815.7352 866.3349 902.9055 913.6549 941.9665 952.9579 959.8597 970.9761 978.4480 1025.3780 1027.1087 1028.6074 1089.7713 1168.0014 1188.3617 1214.1701 1226.4401 1231.7246 1299.8835 1324.4327 1373.0986 1373.9802 1381.2910 1398.8714 1434.6029 1451.9657 1464.1728 1467.3306 1474.4635 1480.0449 1487.5733 1497.0008 1507.4053 1588.3972 1623.1441 2974.8531 2985.4330 2990.3552 3067.3617 3079.5625 3083.1921 3093.4958 3097.0082 3100.3062 3101.4898 3122.5719 3133.4994 3160.7570 3177.3634 3543.6175
redmass: 3.5313 2.2220 1.8950 1.5096 1.1465 2.9694 1.0545 2.6489 3.2460 2.2637 1.2579 2.4364 2.9596 2.5022 2.6131 2.7899 5.4968 5.8159 1.7998 4.0125 1.8485 1.2556 3.6833 1.5070 1.7067 1.6944 1.2048 1.3468 2.7768 1.2867 5.2521 1.3846 1.5759 1.7968 1.5481 1.0492 1.1256 2.1957 3.0670 2.6003 2.5323 1.5440 1.2198 1.2032 3.6046 1.2184 2.3793 1.0509 1.0657 1.0479 1.1157 1.0541 1.7594 1.2081 1.8340 4.5244 6.4165 1.0360 1.0358 1.0365 1.1003 1.0999 1.0996 1.0984 1.0988 1.0977 1.0879 1.0864 1.0933 1.0971 1.0949 1.0762
irintensity: 1.0913 0.1410 0.0954 0.0806 0.5589 3.6707 0.2027 1.0644 0.3101 0.0784 80.7601 1.4247 0.0563 0.9446 1.1270 8.0247 0.0023 0.4330 43.0723 1.3051 84.3511 0.5146 5.5589 9.0688 0.1194 6.7119 0.0011 0.1431 0.3478 0.4825 4.4385 0.2244 1.6152 7.9113 9.3852 0.6829 11.2212 18.0299 26.6795 104.5629 70.4265 27.3271 24.1203 27.1327 56.0822 38.5885 7.4951 1.0484 3.8167 0.2176 15.0785 8.3807 29.7930 57.3327 135.5579 8.1405 186.8914 27.7106 30.2151 23.7544 25.3032 25.5686 19.3280 60.3735 5.9384 46.7732 35.2149 2.1795 36.2947 41.4809 14.0495 20.3496
temp: 298.150 k
press: 1.00000 atm
elementType: 7 6 6 6 6 6 6 6 6 6 6 1 1 1 1 1 1 1 1 1 1 1 1 1 1 1
symmnumber: 1
zpe: 590287.1 jmol-1
zpe.correction: 0.224828 hartree
zpe.thermalcorrener: 0.236523 hartree
zpe.thermalcorrenthalpy: 0.237467 hartree
zpe.thermalcorrgfe: 0.187902 hartree
zpe.sumelectzpe: -443.973019 hartree
zpe.sumelectthermal: -443.961324 hartree
zpe.sumelectthermalent: -443.960380 hartree
zpe.sumelectthermalfe: -444.009946 hartree
dipole: 2.3955 0.6756 -0.0013
dipole: 2.4889
quadrupole: -63.5274 -61.4563 -72.7998
quadrupole: 0.5463 -0.0140 -0.0121
quadrupole: 2.4004 4.4715 -6.8720 0.5463 -0.0140 -0.0121
hfenergy: -444.1978472 hartree
pointgroup: C01 [X(C10H15N1)]
dipole: -0.9613985 0.0810293 0.1674098 debye
dipolederiv: -1.7601055 -0.0562827 -0.0257766 0.0922729 -0.4389584 0.1457839 0.1969885 0.1517746 -0.3216088 0.8486121 0.1044658 0.1360451 0.2841046 0.4144744 -0.0270238 0.4015143 -0.0177175 0.3776745 -0.1169452 0.0175259 0.0348786 0.0040253 0.0418435 -0.02583 0.013745 -0.0266457 0.0177146 -0.0840713 0.0104354 0.0319145 -0.0357505 -0.01033 0.0791353 -0.095493 0.0441967 -0.1382389 -0.0826393 0.0276325 0.0231058 -0.0735006 -0.1652613 -0.0161871 -0.067204 0.0105501 0.0143625 1.6827727 -0.0060161 -0.0831697 -0.231404 0.086332 -0.076359 -0.4208791 -0.0870838 0.0345587 -0.3801055 -0.0404128 -0.0532119 0.2869712 -0.1622224 0.0986687 0.434353 0.1144698 -0.0888005 -0.5020308 0.0439273 0.0774285 -0.1798616 -0.153119 0.1452921 -0.2559275 0.1344633 -0.0327743 0.2962511 0.0890323 0.1108982 -0.0164415 -0.0413398 0.1504054 -0.0464638 0.1452817 0.0762112 0.2216335 -0.0538621 -0.097227 0.0045914 -0.0226397 0.15442 -0.010472 0.1572268 0.1072476 -0.1664939 -0.0314134 -0.0507365 -0.0173952 -0.2596941 -0.0283046 -0.0297978 -0.0275319 -0.2795713 0.1291334 -0.018828 -0.0216553 -0.0363575 0.2000464 -0.0968195 -0.0464339 -0.0971094 0.123241 0.1028681 -0.0213003 0.0051866 0.037576 -0.1776802 -0.0294797 0.0243999 -0.0046339 0.0793728 -0.1052336 -0.0438195 -0.0583833 -0.0848472 0.0735987 -0.0412428 -0.1208071 -0.0427296 0.0428984 0.1017343 0.0168606 -0.0263391 0.0111332 0.0524166 0.0935179 0.0359977 0.0708662 -0.1495476 -0.019086 0.0347478 0.1396138 0.0487684 0.069186 -0.0414146 0.1389868 -0.0120145 0.0131672 0.1001575 0.0141111 -0.0112163 0.0263398 -0.1634144 0.033506 0.027069 -0.0246365 0.0675342 -0.1258182 -0.0688885 -0.1228516 -0.0896721 0.0575567 -0.0438542 -0.1340854 -0.0191619 0.0282118 0.1023764 -0.0062353 -0.0041849 0.0217479 0.0305647 0.0553236 0.0178559 0.1153341 -0.126572 -0.1302239 -0.096995 -0.1027926 -0.0967776 0.0477874 -0.0205171 -0.1240927 -0.0449267 0.0425659 -0.0203666 0.1100247 0.0917617 0.1040781 0.0488968 -0.0246974 0.1052042 -0.0538074 0.032592 -0.0030374 -0.0630914 -0.0865337 -0.0825015 0.0923276 -0.0931435 -0.1152006 -0.0940328 0.0235574 0.0192809 0.0605607 0.0970426 0.0374876 0.0803509 -0.1217162 0.0628156 -0.1228227 -0.02452 0.0537364 0.0332451 0.0540949 0.0499895 0.0684545 -0.123409 0.0790127 -0.1227669 -0.0364024 -0.014862 -0.0669692 -0.0913078 -0.0763344 0.0823668 -0.0986237 -0.1050696 -0.0991021 0.0092704 -0.1475373 0.0115453 0.0334161 0.0117579 0.148456 -0.0474308 0.0339842 -0.0474398 0.1078554 unknown
polarizability: 160.7177459|3.0309408|84.6826371|0.1630401|19.2651012|100.2213627 unknown
InChI: InChI=1S/C10H15N/c1-10(2,3)11-9-7-5-4-6-8-9/h4-8,11H,1-3H3
charge 0 multiplicity 1
26 atoms
N  -0.929545 0.459193 0.557325
C  -2.114653 -0.066103 -0.17262
C  -3.352212 0.424949 0.623895
C  -2.193262 0.512824 -1.614118
C  -2.128375 -1.621614 -0.19097
C  0.435447 0.317581 0.279248
C  0.968768 -0.41029 -0.82826
C  1.365802 0.946668 1.167744
C  2.364288 -0.49569 -1.023908
C  2.753489 0.85266 0.959594
C  3.273359 0.128892 -0.141217
H  -1.145059 1.009065 1.389929
H  -3.380243 1.530052 0.670159
H  -4.281004 0.08194 0.137006
H  -3.342016 0.026555 1.656072
H  -1.310755 0.245737 -2.218092
H  -2.252514 1.615303 -1.577807
H  -3.091633 0.129278 -2.131857
H  -2.116672 -2.013049 0.841936
H  -3.040453 -1.988179 -0.696676
H  -1.255452 -2.040239 -0.717806
H  0.30843 -0.910919 -1.539562
H  0.982734 1.51282 2.027683
H  2.741753 -1.061821 -1.884027
H  3.434476 1.348097 1.661811
H  4.353403 0.055691 -0.303783
