program: Gaussian 09
title: 000254294
version: EM64L-G09RevD.01
frameworkgroup: C1[X(C13H24N2O2)]
method: RPBEPBE
basis: SDD
operation: Freq
keyword: #p
keyword: freq=noraman
keyword: PBEPBE/SDD
title: #p freq=noraman PBEPBE/SDD
converged: NO YES NO NO
title: Mulliken charges:
elementType: O O N N C C C C C C C C C C C C C H H H H H H H H H H H H H H H H H H H H H H H H
charge: -0.279166 -0.248616 -0.104867 -0.358894 -0.355287 -0.343394 -0.430113 -0.378223 -0.348283 -0.395005 -0.325810 -0.414473 -0.355320 0.227720 -0.609972 0.272524 -0.768711 0.178736 0.200497 0.184507 0.182476 0.195431 0.203342 0.258421 0.168696 0.178252 0.204274 0.200747 0.177565 0.180202 0.200022 0.209085 0.201099 0.264338 0.214267 0.339344 0.265707 0.257820 0.259434 0.244158 0.247473
chargesum: 0.00000
title: Mulliken charges with hydrogens summed into heavy atoms:
elementType: O O N N C C C C C C C C C C C C C
charge: -0.279166 -0.248616 -0.104867 -0.019551 0.023946 0.023588 -0.031340 0.048894 0.034243 -0.016693 0.054414 -0.004289 0.123285 0.227720 -0.086446 0.272524 -0.017646
polarizability: 1.79308188e+02 1.60009051e+00 1.64705686e+02 -1.24967117e+01 2.75431733e-01 1.32088604e+02
1716.lowfreq: -25.0238 -10.2521 -7.5483 -0.0008 -0.0001 0.0004 6.9298 17.2407 36.6743
frequency: -12.3649 15.5585 36.6182 48.4480 51.8174 71.0918 77.6299 104.9158 160.4744 168.0145 195.6275 207.1749 231.0295 253.6954 286.8585 295.7247 319.7351 324.5725 359.3356 374.5000 401.3525 420.7267 461.9423 485.6559 493.8152 542.3962 548.3789 569.3105 676.3568 697.4661 765.1728 778.2335 806.4295 810.4012 815.8894 836.1044 855.6352 871.3971 877.3891 894.2973 904.0057 947.9395 965.5068 976.7686 993.0469 1008.9935 1020.2324 1034.6455 1046.4283 1088.4151 1099.9169 1100.9189 1117.7625 1138.8151 1154.2497 1164.8838 1176.5333 1187.7570 1209.0654 1216.8831 1229.9783 1236.0643 1240.3899 1276.6458 1279.4218 1291.1850 1305.4945 1307.3393 1328.3988 1334.9848 1341.5021 1346.1193 1349.5451 1354.7109 1365.9528 1372.9532 1373.3270 1386.0176 1424.1379 1442.3948 1453.0583 1454.3884 1456.0427 1458.5478 1461.3263 1466.0415 1467.7097 1472.3687 1481.3685 1493.0197 1528.4132 1606.4467 1634.6700 2812.2037 2835.0340 2894.9631 2946.8335 2964.9019 2970.6304 2973.0395 2975.8414 2979.6780 2980.3130 2983.3161 2986.5179 3011.0319 3013.1341 3022.6228 3029.1031 3034.7656 3042.3957 3048.8795 3063.0202 3074.4631 3091.3154 3126.6567 3392.4916
redmass: 4.1761 3.9028 4.1062 3.5822 3.4626 4.7291 4.4881 2.7859 1.2092 2.0082 3.0081 2.6621 2.1784 3.5136 3.1034 2.0247 3.3575 2.8137 3.4833 2.2629 2.4172 2.3763 2.3243 2.0483 1.6879 2.7712 3.3412 3.1552 4.0911 2.5498 1.9862 1.1623 1.7781 1.6827 2.2427 2.1348 2.0107 2.7032 1.9384 1.9163 2.4411 2.1894 1.9670 2.0053 1.8643 1.6918 1.8043 1.8965 2.1740 1.9029 2.7931 2.3697 2.3014 1.8864 1.4660 1.9582 1.1874 1.8296 1.3429 1.3674 2.1825 1.4328 1.4949 1.2964 1.2265 1.1575 1.4793 1.7888 1.2923 1.3937 1.3647 1.3314 1.4339 1.4352 1.3638 1.3147 1.2564 1.3720 1.0979 1.0717 1.0547 1.0879 1.0851 1.0898 1.0832 1.0890 1.0821 1.0925 1.0794 1.0927 1.7511 6.6422 6.5375 1.0722 1.0707 1.0694 1.0624 1.0654 1.0612 1.0708 1.0720 1.0676 1.0441 1.0601 1.0665 1.0949 1.0923 1.0911 1.0985 1.1014 1.0957 1.0983 1.0957 1.0964 1.0929 1.1003 1.0799
irintensity: 0.1460 0.3909 1.1663 0.4381 2.5283 2.8698 15.5297 0.4755 0.4342 1.2881 5.4570 2.9888 5.4384 11.9245 4.3986 0.3733 7.8871 0.8355 2.3230 0.6557 2.6139 1.2869 3.4316 0.7783 1.0117 4.0245 21.3530 11.0790 4.1148 6.1626 10.1213 92.4120 4.7669 2.3067 0.9711 8.9632 11.2283 1.6773 1.1856 8.4578 2.2387 7.7105 3.9776 4.0422 24.6073 5.0379 13.2315 16.6358 3.5648 3.8663 4.3317 1.5587 21.1293 14.8178 49.5189 22.3330 2.0295 8.0428 21.6192 24.8655 137.8911 18.7065 7.7215 5.3946 0.8036 1.3366 5.0497 61.3246 13.0497 1.0672 1.5607 12.1591 12.8905 4.0439 0.5593 14.9362 62.7032 0.9610 54.0972 15.8506 18.8104 12.6508 2.1362 25.6665 1.7253 6.4201 17.8458 17.1437 13.5247 14.3174 244.2289 9.5480 291.5660 110.8425 152.6558 99.0600 26.7770 79.5455 32.7131 35.3741 11.5631 44.3919 0.7428 1.8504 83.5700 60.7552 28.6642 32.0897 42.2289 60.9202 90.8091 45.0442 8.4802 5.0492 6.4053 12.1903 139.4415
temp: 298.150 k
press: 1.00000 atm
elementType: 8 8 7 7 6 6 6 6 6 6 6 6 6 6 6 6 6 1 1 1 1 1 1 1 1 1 1 1 1 1 1 1 1 1 1 1 1 1 1 1 1
symmnumber: 1
zpe: 939170.6 jmol-1
zpe.correction: 0.357711 hartree
zpe.thermalcorrener: 0.375636 hartree
zpe.thermalcorrenthalpy: 0.376580 hartree
zpe.thermalcorrgfe: 0.310000 hartree
zpe.sumelectzpe: -768.360377 hartree
zpe.sumelectthermal: -768.342452 hartree
zpe.sumelectthermalent: -768.341508 hartree
zpe.sumelectthermalfe: -768.408088 hartree
dipole: -2.0494 0.3918 1.4124
dipole: 2.5196
quadrupole: -91.3023 -105.7518 -104.7462
quadrupole: 11.4891 -0.1893 -6.8834
quadrupole: 9.2978 -5.1517 -4.1461 11.4891 -0.1893 -6.8834
hfenergy: -768.7180881 hartree
pointgroup: C01 [X(C13H24N2O2)]
dipole: -0.7705605 -0.0353634 -0.6225787 debye
polarizability: 179.3216767|-4.2826603|158.1012127|11.8215627|13.1135431|138.6795896 unknown
InChI: InChI=1S/C13H24N2O2/c1-12(16)11-13(17)14-7-6-10-15-8-4-2-3-5-9-15/h14H,2-11H2,1H3
charge 0 multiplicity 1
41 atoms
O  -1.29009 0.4356 1.719328
O  -3.915757 -1.472831 -1.100118
N  1.770604 -0.21894 -0.77333
N  -1.606551 -1.524167 0.472389
C  3.14327 -0.76558 -0.76339
C  1.643649 1.245216 -0.986295
C  4.181507 0.116477 -0.030045
C  1.616717 2.034163 0.346371
C  3.686162 0.746304 1.298164
C  2.970597 2.106401 1.091919
C  0.809549 -1.074092 -1.497696
C  0.436805 -2.361099 -0.719939
C  -0.243667 -2.063663 0.634145
C  -2.01758 -0.333764 1.01821
C  -3.508791 0.035761 0.781415
C  -4.137508 -0.349484 -0.557443
C  -5.050154 0.674533 -1.206731
H  3.514882 -0.956647 -1.806484
H  3.11151 -1.753188 -0.260416
H  0.688074 1.43043 -1.513352
H  2.446747 1.640559 -1.653076
H  4.528839 0.930383 -0.697511
H  5.068937 -0.520133 0.158304
H  0.851995 1.56074 0.990215
H  1.274395 3.070727 0.139351
H  4.557674 0.910839 1.963228
H  3.009809 0.040891 1.819779
H  2.80063 2.581986 2.078945
H  3.662486 2.776391 0.537187
H  1.18822 -1.37087 -2.510697
H  -0.118483 -0.494295 -1.657827
H  1.342486 -2.967774 -0.527403
H  -0.225609 -2.983943 -1.355983
H  0.346805 -1.308148 1.180305
H  -0.289292 -2.986541 1.246211
H  -2.288898 -2.023011 -0.11804
H  -4.091401 -0.475768 1.576714
H  -3.60233 1.117549 0.967683
H  -5.53967 0.247559 -2.095218
H  -5.813834 1.028604 -0.489037
H  -4.460637 1.563329 -1.50503
