program: Gaussian 09
title: 000254271
version: EM64L-G09RevD.01
frameworkgroup: C1[X(C9H9N3O6S3)]
method: RPBEPBE
basis: SDD
operation: Freq
keyword: #p
keyword: freq=noraman
keyword: PBEPBE/SDD
title: #p freq=noraman PBEPBE/SDD
converged: NO YES NO NO
title: Mulliken charges:
elementType: S S S O O O O O O N N N C C C C C C C C C H H H H H H H H H
charge: 0.351826 0.354018 0.340903 -0.409412 -0.411822 -0.410575 -0.213612 -0.209097 -0.210524 0.071656 0.060705 0.056066 -0.360872 -0.337674 -0.314531 -0.694657 -0.692563 -0.689677 0.223996 0.225894 0.226057 0.318946 0.319147 0.308519 0.308632 0.310008 0.309900 0.388536 0.389911 0.390295
chargesum: 0.00000
title: Mulliken charges with hydrogens summed into heavy atoms:
elementType: S S S O O O O O O N N N C C C C C C C C C
charge: 0.351826 0.354018 0.340903 -0.020875 -0.021911 -0.020280 -0.213612 -0.209097 -0.210524 0.071656 0.060705 0.056066 -0.360872 -0.337674 -0.314531 -0.056564 -0.075412 -0.069769 0.223996 0.225894 0.226057
polarizability: 3.07258631e+02 -9.01390797e-01 2.33500307e+02 1.01561624e-01 7.03002018e-02 8.25859281e+01
1716.lowfreq: -3.6307 -2.2134 -0.0015 -0.0004 0.0019 2.0487 17.0427 19.5041 21.4321
frequency: 17.0285 19.4956 21.4210 25.3071 30.2591 37.9452 40.0153 47.6429 71.5900 80.3124 91.9474 93.9485 139.0762 153.7459 157.7146 159.9201 164.9570 171.1947 200.5894 253.5537 342.5594 362.2583 381.6187 413.7104 442.5351 455.6947 494.1151 498.2178 498.5674 501.5400 565.3103 566.8867 568.4198 610.1061 613.3281 628.2944 631.0855 633.1076 740.0958 747.1550 750.9940 786.3251 796.3736 797.4434 873.3127 873.6072 874.5920 893.5536 898.0748 898.3874 901.5247 1045.3561 1048.0926 1051.4795 1138.3676 1141.6342 1143.2468 1179.1270 1193.7449 1200.6529 1224.0004 1230.3455 1232.1428 1253.9076 1323.2163 1327.2462 1328.6520 1391.5787 1404.8282 1407.6005 1415.6726 1427.2776 1671.5077 1672.8762 1674.3710 3051.0840 3051.9803 3055.6069 3118.3495 3119.2635 3121.8738 3517.9412 3518.8079 3520.0899
redmass: 8.7543 9.5710 11.5165 12.0466 9.6313 5.7041 8.5291 9.4581 2.7057 2.8985 3.5029 8.8913 15.8052 9.6406 9.5369 9.7960 11.8838 11.7036 11.0604 12.0711 9.8793 12.1739 9.7000 15.3888 15.0176 15.6176 11.8579 1.7825 1.7901 1.7946 4.7236 4.8213 4.8433 12.1486 11.2985 1.3816 1.3589 1.3545 6.9635 6.7876 7.0464 12.6251 13.2410 13.0092 4.9983 4.9184 4.9544 12.9535 1.7916 1.7851 1.7607 2.2130 2.2003 2.1769 1.1385 1.1342 1.1367 12.1222 7.2534 5.4745 1.5539 1.5604 1.4390 5.1643 2.2258 2.2010 2.2171 9.5189 1.1023 1.1835 1.2723 3.6063 8.9527 8.9692 9.0210 1.0582 1.0582 1.0586 1.1041 1.1042 1.1039 1.0641 1.0642 1.0642
irintensity: 1.0101 0.0036 1.6343 2.6858 0.0204 0.0740 0.8238 0.8709 0.4977 7.7611 0.2509 2.8652 0.0016 0.3219 1.5357 6.4723 0.0462 0.0669 0.9325 0.8822 5.2070 11.2603 7.5776 11.0365 13.0053 2.1350 0.3060 1.6469 29.7886 66.9057 140.7474 22.8532 15.5048 0.1938 0.7340 54.1890 112.6457 258.7139 15.1977 11.2256 37.1156 2.5804 142.2213 92.8104 5.3353 4.9047 12.8479 1.2231 5.0305 3.0814 20.5538 41.2588 627.5063 418.4472 0.0106 0.0320 0.3632 88.9531 214.9872 176.4919 0.3352 7.2729 2.1730 0.3695 26.9159 156.8996 24.3872 811.0890 44.0232 334.1370 214.5697 611.8530 140.0125 353.5771 74.9006 3.5252 10.2967 6.9056 0.6258 0.4440 0.0192 37.3948 35.5513 37.1097
temp: 298.150 k
press: 1.00000 atm
elementType: 16 16 16 8 8 8 8 8 8 7 7 7 6 6 6 6 6 6 6 6 6 1 1 1 1 1 1 1 1 1
symmnumber: 1
zpe: 491775.1 jmol-1
zpe.correction: 0.187307 hartree
zpe.thermalcorrener: 0.210356 hartree
zpe.thermalcorrenthalpy: 0.211301 hartree
zpe.thermalcorrgfe: 0.127123 hartree
zpe.sumelectzpe: -2156.573834 hartree
zpe.sumelectthermal: -2156.550784 hartree
zpe.sumelectthermalent: -2156.549840 hartree
zpe.sumelectthermalfe: -2156.634018 hartree
dipole: -3.6936 4.0797 -0.0047
dipole: 5.5033
quadrupole: -106.7116 -170.4752 -139.6724
quadrupole: 1.5267 0.1013 -0.0976
quadrupole: 32.2414 -31.5221 -0.7193 1.5267 0.1013 -0.0976
hfenergy: -2156.761141 hartree
pointgroup: C01 [X(C9H9N3O6S3)]
dipole: -1.4879935 1.5719944 0.051017 debye
polarizability: 307.258234|0.7454002|233.36575|-0.9845623|4.4362649|82.7208823 unknown
InChI: InChI=1S/C9H9N3O6S3/c13-4(14)1-19-7-10-8(20-2-5(15)16)12-9(11-7)21-3-6(17)18/h13,15,17H,1-3H2
charge 0 multiplicity 1
30 atoms
S  3.520658 -1.529175 -0.138299
S  -1.655938 -2.817999 -0.149554
S  -0.116989 2.484965 -0.00453
O  6.534925 1.166581 -0.075024
O  -5.589247 -1.878522 -0.108724
O  -3.937311 3.806781 0.044921
O  6.493682 -1.158721 -0.157283
O  -4.449858 -3.907489 -0.170272
O  -1.884713 4.903974 0.078373
N  0.870315 -1.939226 -0.134404
N  1.54684 0.390814 -0.070674
N  -0.812694 -0.187137 -0.076695
C  1.812046 -0.949392 -0.110419
C  -0.417734 -1.501178 -0.115292
C  0.219103 0.707755 -0.055158
C  4.385563 0.147787 -0.091373
C  -3.213955 -1.756181 -0.114108
C  -2.001062 2.426714 -0.002433
C  5.883927 -0.07144 -0.11542
C  -4.428974 -2.661581 -0.136854
C  -2.538363 3.842831 0.045643
H  4.086085 0.691968 0.817768
H  4.066545 0.751645 -0.955024
H  -3.222666 -1.081306 -0.984153
H  -3.217159 -1.132879 0.793661
H  -2.352447 1.852445 0.868926
H  -2.356318 1.911154 -0.908284
H  7.520462 1.024471 -0.088078
H  -6.390176 -2.470127 -0.121564
H  -4.294645 4.735767 0.075029
