program: Gaussian 09
title: 000254248
version: EM64L-G09RevD.01
frameworkgroup: C1[X(C6H6N2O2)]
method: RPBEPBE
basis: SDD
operation: Freq
keyword: #pfreq=noraman
keyword: PBEPBE/SDD
title: #p freq=noraman PBEPBE/SDD
converged: YES YES YES YES
title: Mulliken charges:
elementType: O O N N C C C C C C H H H H H H
charge: -0.228463 -0.243308 0.018824 0.011798 0.039152 -0.226593 0.222463 -0.258978 -0.360037 -0.501277 0.276854 0.258590 0.257884 0.245012 0.245010 0.243071
chargesum: 0.00000
title: Mulliken charges with hydrogens summed into heavy atoms:
elementType: O O N N C C C C C C
charge: -0.228463 -0.243308 0.018824 0.011798 0.039152 0.050261 0.222463 -0.000389 -0.102153 0.231816
polarizability: 1.14140838e+02 1.02251242e+00 8.76625122e+01 2.22316820e-03 2.43814431e-03 3.95163225e+01
1716.lowfreq: -7.2296 -5.1107 -0.0005 -0.0003 0.0003 9.3218 42.6606 89.9469 111.0017
frequency: 42.6566 89.9348 111.0010 150.0196 195.6822 294.9921 342.8324 347.0956 457.6560 467.5324 645.2020 681.4416 689.5869 782.6494 793.5962 870.2420 917.4753 941.3724 952.7925 999.5925 1049.1218 1100.1911 1113.1432 1144.0863 1153.7134 1223.0474 1270.2225 1281.5423 1375.4676 1419.6663 1429.0154 1453.3244 1459.1376 1515.5184 1540.5131 1607.6165 3007.0272 3109.4815 3148.6604 3157.8729 3167.7303 3186.7729
redmass: 4.9124 1.2579 2.9780 4.4291 5.2084 4.8805 6.5308 2.8908 5.1157 8.7919 8.3527 7.2118 4.2488 6.3007 4.3095 1.5169 7.9077 9.7888 1.4258 1.4432 1.9068 4.5771 1.2656 2.2533 1.5742 12.0086 2.0909 4.0483 1.4859 1.3088 1.5909 1.0493 1.0521 5.8380 6.0125 9.8689 1.0297 1.1046 1.0912 1.1048 1.0930 1.0968
irintensity: 4.3207 0.6636 0.0419 3.4417 11.2677 22.9212 0.4084 2.4046 0.4435 1.3484 15.7048 14.7167 31.8891 3.1831 1.0839 27.2377 10.3781 0.4557 0.1488 0.8668 16.2840 117.2986 0.0172 15.2503 41.6019 8.3530 8.6563 222.3214 35.8171 29.1806 7.2563 16.0656 9.4278 29.6279 33.7647 137.8337 27.5303 24.1471 14.5719 12.4200 13.6427 2.6140
temp: 298.150 k
press: 1.00000 atm
elementType: 8 8 7 7 6 6 6 6 6 6 1 1 1 1 1 1
symmnumber: 1
zpe: 303171.0 jmol-1
zpe.correction: 0.115472 hartree
zpe.thermalcorrener: 0.124482 hartree
zpe.thermalcorrenthalpy: 0.125426 hartree
zpe.thermalcorrgfe: 0.080305 hartree
zpe.sumelectzpe: -491.437352 hartree
zpe.sumelectthermal: -491.428342 hartree
zpe.sumelectthermalent: -491.427398 hartree
zpe.sumelectthermalfe: -491.472518 hartree
dipole: -1.2968 0.6367 0.0008
dipole: 1.4447
quadrupole: -52.2733 -58.6672 -57.2720
quadrupole: 7.1944 -0.0020 0.0027
quadrupole: 3.7976 -2.5964 -1.2012 7.1944 -0.0020 0.0027
hfenergy: -491.5528234 hartree
pointgroup: C01 [X(C6H6N2O2)]
dipole: 0.5146722 -0.2411969 0.0001633 debye
dipolederiv: -1.1654877 -0.3826602 -0.0000949 -0.591853 -0.7654323 -0.0001873 -0.0003039 -0.0002656 -0.2647842 -0.7096977 0.2101388 0.0002088 -0.0993861 -0.837301 -0.0003507 -0.0000169 -0.0002211 -0.3135387 -0.4567191 0.2062391 0.0000369 0.0219229 -0.4222733 -0.0000134 0.000082 -0.0000344 -0.1681724 -0.3654382 -0.0558321 0.0000668 0.1173053 -0.4717334 -0.000003 0.0000512 0.0000007 -0.2069693 0.1460921 -0.0831087 -0.0000234 0.1380907 0.2039849 -0.0000568 0.0000676 -0.0000069 0.0766965 -0.4682361 -0.1723787 0.0000812 -0.0718281 -0.0793314 0.0000182 0.0001403 0.0000596 -0.0143239 1.4686725 0.1376707 -0.0001648 0.546347 1.2929358 0.0005954 0.0001196 0.0004939 0.2052266 0.4294539 0.2430293 -0.0000849 0.0066166 0.2831852 0.0000152 -0.0001501 -0.0000459 -0.0315031 0.2500229 -0.1613762 -0.0000582 -0.1902561 0.546583 0.0000244 -0.0000434 -0.0000489 0.0018241 0.678154 0.1449487 0.0000407 0.0851821 0.2413434 -0.0000372 0.0000385 -0.0000211 0.2787088 0.139217 0.0617957 0.0000087 0.0403112 0.0185832 -0.0000148 -0.0000095 -0.0000317 0.1608535 0.0265742 -0.0948439 0.000014 -0.0769173 -0.0197712 0.0000108 0.0000353 0.0000232 0.1240173 0.0568853 0.0547763 0.0000137 0.0594436 -0.0480962 -0.0000167 -0.0000296 0.0000768 0.1261368 -0.0310358 -0.0292975 0.0141101 0.0611975 0.0624594 -0.1005697 0.0578345 -0.0687122 -0.0499278 -0.0310335 -0.0292763 -0.0141341 0.0612755 0.0622625 0.1006904 -0.057762 0.0688436 -0.0497191 0.0325764 -0.0498249 -0.0000206 -0.1074518 -0.0673987 -0.0001047 -0.0000535 -0.00011 0.1254749 unknown
polarizability: 114.0950824|1.5016407|87.7082643|-0.0132721|0.0087612|39.5163263 unknown
InChI: InChI=1S/C6H6N2O2/c1-10-6(9)5-2-3-7-4-8-5/h2-4H,1H3
charge 0 multiplicity 1
16 atoms
O  2.089719 0.825893 -0.000217
O  1.847296 -1.490541 -0.001337
N  -0.61749 1.195332 -0.000203
N  -2.899307 0.319102 0.00031
C  -0.140245 -0.088205 -0.000398
C  -1.003416 -1.211146 -0.000251
C  1.347396 -0.336892 -0.000832
C  -2.392034 -0.952505 0.000097
C  -1.975087 1.328129 0.000246
C  3.562408 0.639294 -0.000419
H  -0.592603 -2.223651 -0.000448
H  -3.125895 -1.76517 0.000241
H  -2.36741 2.349486 0.000092
H  3.875015 0.08289 -0.899927
H  3.875136 0.081834 0.898394
H  3.968417 1.659551 0.000152
