program: Gaussian 09
title: 000254262
version: EM64L-G09RevD.01
frameworkgroup: C1[X(C12H8BrNO3)]
method: RPBEPBE
basis: SDD
operation: Freq
keyword: #p
keyword: freq=noraman
keyword: PBEPBE/SDD
title: #p freq=noraman PBEPBE/SDD
converged: YES YES NO NO
title: Mulliken charges:
elementType: Br O O O N C C C C C C C C C C C C H H H H H H H H
charge: 0.029083 -0.289019 -0.213823 -0.213892 0.021990 0.338343 0.344943 -0.347887 -0.316363 0.380853 -0.330312 -0.345763 -0.349519 -0.365845 -0.150007 -0.143228 -0.236351 0.269972 0.276945 0.291330 0.288870 0.275503 0.268504 0.257455 0.258219
chargesum: 0.00000
title: Mulliken charges with hydrogens summed into heavy atoms:
elementType: Br O O O N C C C C C C C C C C C C
charge: 0.029083 -0.289019 -0.213823 -0.213892 0.021990 0.338343 0.344943 -0.077915 -0.039418 0.380853 -0.038982 -0.056893 -0.074015 -0.097342 0.107447 0.114991 -0.236351
polarizability: 3.14130550e+02 -4.52880842e-01 1.42083981e+02 -1.36985457e+01 -2.31704460e+00 8.73545432e+01
1716.lowfreq: -10.0612 -2.8597 0.0004 0.0006 0.0007 2.1770 19.8934 31.9894 46.3969
frequency: 19.8099 31.9745 46.3891 76.4059 103.3697 116.7804 176.7143 199.6082 244.5479 288.0204 301.9009 329.7528 377.8645 410.9815 418.6120 434.4203 486.9768 492.9694 507.9760 599.3225 613.2419 633.5231 640.5330 664.4130 701.0638 726.5210 742.1440 790.0779 817.1513 831.5533 836.0892 853.8485 860.1646 948.7079 962.7910 983.5627 990.9817 992.8257 996.2449 1055.6794 1095.1773 1103.5730 1108.6092 1152.5118 1165.8000 1183.3831 1221.6160 1230.6567 1283.9818 1288.9387 1354.8697 1364.0334 1392.4238 1404.9032 1430.9097 1461.1923 1472.7809 1581.4536 1588.6807 1593.5349 1612.2161 3155.8132 3164.4740 3166.1274 3170.7281 3176.4423 3183.4273 3185.9601 3190.8722
redmass: 6.0023 9.6121 6.1706 6.1070 8.7972 7.6115 12.5236 8.6108 8.0221 6.3307 6.7703 9.2123 6.1571 2.9496 3.0440 6.1552 3.3812 3.4766 6.6165 5.8769 7.4629 8.0731 6.8975 4.7950 4.0677 5.5050 6.0067 7.7803 1.2757 1.5216 1.2864 4.7488 1.7220 1.3302 1.3585 1.3188 1.3513 4.6192 2.8979 2.5133 3.2152 1.3213 1.2460 2.1087 1.3729 1.4870 4.9942 5.3306 1.2544 1.2672 7.2427 7.2883 3.7602 8.3665 4.3399 2.3176 2.4667 7.0305 7.2537 7.6368 6.8447 1.0892 1.0890 1.0891 1.0894 1.0969 1.0979 1.0962 1.0973
irintensity: 0.7577 0.6345 0.3907 0.1067 2.8689 0.2355 2.3642 2.9777 1.1520 1.0910 1.6187 5.6016 3.6273 0.2803 1.3067 4.2544 14.9792 36.4832 1.2303 3.4258 9.7886 16.8537 4.2591 18.1788 2.7352 8.8153 4.3574 14.0836 6.2363 57.3750 18.9599 45.3269 56.4340 0.5519 0.4158 3.0902 0.6254 105.5575 0.4356 55.0344 17.7495 9.0187 24.5943 6.5768 272.1648 53.0446 837.5891 115.1156 1.7081 1.7372 70.2551 26.6243 3.4656 17.2989 16.6520 320.6930 55.2502 17.1338 32.5351 84.8297 150.3667 5.6833 2.5867 1.6744 0.6472 2.2730 0.8802 1.3447 4.0175
temp: 298.150 k
press: 1.00000 atm
elementType: 35 8 8 8 7 6 6 6 6 6 6 6 6 6 6 6 6 1 1 1 1 1 1 1 1
symmnumber: 1
zpe: 453328.5 jmol-1
zpe.correction: 0.172664 hartree
zpe.thermalcorrener: 0.187068 hartree
zpe.thermalcorrenthalpy: 0.188013 hartree
zpe.thermalcorrgfe: 0.127836 hartree
zpe.sumelectzpe: -754.678447 hartree
zpe.sumelectthermal: -754.664042 hartree
zpe.sumelectthermalent: -754.663098 hartree
zpe.sumelectthermalfe: -754.723275 hartree
dipole: 4.3651 1.9875 0.0838
dipole: 4.7970
quadrupole: -151.9213 -105.6739 -103.8939
quadrupole: -11.5899 -3.7081 -3.6553
quadrupole: -31.4250 14.8224 16.6025 -11.5899 -3.7081 -3.6553
hfenergy: -754.8511107 hartree
pointgroup: C01 [X(C12H8Br1N1O3)]
dipole: 1.7929995 -0.5820103 -0.0912403 debye
dipolederiv: -0.6634639 -0.2538948 -0.0195938 -0.3435318 -0.1790078 0.0087803 -0.033962 0.0036965 -0.0355902 -2.7306676 -0.0783375 0.0124853 0.0165859 -0.3887269 -0.0138337 -0.3586524 -0.0401406 -0.2145763 -1.0538005 -0.1184554 -0.1072906 -0.2284573 -0.4726226 -0.1200793 -0.1697571 -0.1182372 -0.2988325 -0.6674883 0.1531912 0.0388115 0.3947503 -0.7328587 -0.2060238 0.1352699 -0.2057724 -0.321109 2.2242529 -0.2334189 0.0324717 -0.4432 1.0083304 0.3400694 -0.0211618 0.3405251 0.3467256 2.1866729 -0.1357327 -0.0534753 -0.799727 0.2372145 0.0915916 0.1081162 0.0895564 0.1546401 1.6423564 0.2640174 0.0247869 0.8879013 0.2141841 -0.0513918 0.3004277 -0.0105855 0.1224341 -0.8097714 0.0224783 0.0131118 -0.1975792 0.072249 0.0833043 -0.0768864 0.0894893 -0.126002 -0.4758571 0.095221 0.055994 0.6430862 -0.1988923 -0.0025058 0.2068878 -0.0037818 -0.1429269 -1.0673057 0.1923908 0.028789 0.362105 -0.1203321 -0.055222 0.0347558 -0.0516784 0.0067415 0.3442211 -0.0429185 0.0048832 -0.3839235 0.0727325 0.0577339 -0.1320969 0.0680342 -0.0665541 0.5321989 -0.1050635 -0.0066419 0.0644098 -0.0082601 0.0434359 0.1019104 0.0214028 -0.0660561 -0.2699636 0.0043107 0.0464181 -0.1721454 -0.1070482 -0.0394646 0.0592377 -0.0351004 -0.0871501 -0.2782608 0.0034713 0.026292 -0.0378838 -0.006868 -0.0642802 -0.0019227 -0.0767642 -0.0811095 -0.269153 -0.0821255 -0.0065049 -0.116608 -0.0244319 -0.0835434 0.0102521 -0.0729406 -0.0130116 -0.2450484 -0.1491606 0.0732344 -0.1589274 -0.1001839 -0.0404424 0.0804275 -0.0520736 -0.0168777 1.0702596 0.5452484 0.0544154 0.6466098 0.2153315 -0.0282152 0.0505843 -0.0207177 -0.1018541 0.0994168 0.044724 0.0069588 0.0405206 0.0162242 -0.0656491 0.00871 -0.0640186 0.1367504 0.0363036 -0.0417608 -0.043418 -0.0862391 0.061791 -0.0361718 -0.0942449 -0.0358482 0.1266848 0.068644 -0.0572224 -0.0346552 -0.0077076 0.1091401 -0.0294645 -0.02071 -0.0285962 0.154392 0.1092307 0.0276637 0.0128175 -0.0077999 0.0639616 -0.0503171 0.0140883 -0.0432382 0.145415 0.0184547 0.005357 -0.0837068 0.015198 0.0922614 0.0379327 -0.1314701 0.0339525 0.094495 0.1133318 -0.058133 -0.0021003 -0.0572122 0.0360086 0.083348 0.002406 0.0789649 0.1034068 0.0777046 -0.0281072 0.0011161 -0.0439276 0.0330075 0.0901393 0.008043 0.0847233 0.0902803 0.0077324 0.0262571 -0.0751988 0.0137028 0.1067961 0.0502693 -0.0802525 0.0491486 0.0896845 unknown
polarizability: 312.132805|18.3821912|144.105959|13.5058285|3.3541817|87.3303104 unknown
InChI: InChI=1S/C12H8BrNO3/c13-9-1-5-11(6-2-9)17-12-7-3-10(4-8-12)14(15)16/h1-8H
charge 0 multiplicity 1
25 atoms
Br 6.101275 1.571267 0.055194
O  0.731617 -1.468679 -0.151065
O  -5.497746 -0.192285 -0.257415
O  -4.736131 1.749649 0.671039
N  -4.546339 0.571649 0.171454
C  -0.540554 -0.878042 -0.077413
C  1.91909 -0.687572 -0.076762
C  -1.606722 -1.686427 -0.545369
C  -0.783842 0.402717 0.482223
C  -3.161501 0.068624 0.086413
C  -2.925278 -1.213275 -0.464418
C  -2.105055 0.876604 0.563741
C  2.114761 0.454333 -0.885545
C  2.944716 -1.180161 0.75517
C  3.356409 1.125448 -0.843431
C  4.188767 -0.512504 0.794306
C  4.378871 0.636885 -0.001726
H  -1.378215 -2.670716 -0.962745
H  0.041737 1.010114 0.862818
H  -3.770482 -1.80882 -0.818272
H  -2.332886 1.854715 0.995262
H  1.322311 0.809891 -1.551217
H  2.767363 -2.075949 1.356672
H  3.522765 2.008797 -1.466051
H  4.991769 -0.883864 1.436635
