program: Gaussian 09
title: 000254306
version: EM64L-G09RevD.01
frameworkgroup: C1[X(C10H19NO7S2)]
method: RPBEPBE
basis: SDD
operation: Freq
keyword: #p
keyword: freq=noraman
keyword: PBEPBE/SDD
title: #p freq=noraman PBEPBE/SDD
converged: YES YES NO NO
title: Mulliken charges:
elementType: S S O O O O O O O N C C C C C C C C C C H H H H H H H H H H H H H H H H H H H
charge: 0.089816 0.968321 -0.275130 -0.255895 -0.230652 -0.265662 -0.557969 -0.494681 -0.494980 -0.363315 -0.158680 -0.572597 -0.280837 0.291376 -0.762129 0.277715 -0.264822 -0.263024 -0.661966 -0.662471 0.250721 0.277492 0.255207 0.328867 0.249793 0.240748 0.322555 0.296233 0.237275 0.228601 0.228623 0.239285 0.224439 0.251584 0.225595 0.223000 0.229007 0.250201 0.378355
chargesum: 0.00000
title: Mulliken charges with hydrogens summed into heavy atoms:
elementType: S S O O O O O O O N C C C C C C C C C C
charge: 0.089816 0.968321 -0.275130 -0.255895 -0.230652 -0.265662 -0.179615 -0.494681 -0.494980 -0.034447 0.092042 -0.039898 0.209704 0.291376 -0.143341 0.277715 0.201053 0.204885 0.039652 0.039737
polarizability: 3.75312211e+02 4.68626372e+01 2.27189384e+02 -9.15459531e+00 -1.20537385e+00 1.42831826e+02
1716.lowfreq: -10.1486 -4.7155 -3.5297 -0.0011 -0.0010 0.0010 2.9380 12.3780 18.9402
frequency: -9.1258 11.6433 18.9180 23.3135 25.9822 37.3312 42.6523 57.4993 73.2466 77.0749 97.6761 102.7372 117.0237 128.1093 137.8676 159.8681 173.9767 183.4733 201.5859 212.6847 228.9722 236.9831 245.8854 270.7397 283.9634 287.9034 306.1721 313.0768 327.4497 354.2778 371.8020 404.4584 429.2589 436.6142 499.7916 523.5959 599.3617 629.4209 650.6632 684.6221 706.6565 720.7619 746.9184 761.8155 805.2963 811.3058 815.4812 829.9260 860.9452 897.2905 931.4132 937.1151 988.6447 1005.7534 1011.5663 1034.0201 1056.3255 1059.9503 1072.4392 1094.4290 1097.2665 1118.0861 1141.7245 1143.7804 1157.0156 1157.5505 1194.8462 1220.9337 1266.5654 1276.5283 1278.5448 1287.0936 1296.1032 1311.5386 1343.2437 1353.0150 1361.8558 1373.2198 1392.3114 1392.5547 1421.0468 1439.8075 1455.7040 1458.1801 1463.9715 1465.4657 1477.6600 1484.2790 1484.3649 1494.2469 1614.0283 1641.5820 2934.9503 2942.2931 2959.9537 2993.3188 2995.0154 3021.3709 3034.0585 3034.1525 3051.1341 3070.8133 3088.1763 3090.3366 3095.4397 3096.8418 3110.3561 3122.6600 3123.4759 3416.4891 3452.0582
redmass: 7.3442 5.4943 6.7719 4.9383 4.0852 5.2857 4.9952 3.4419 3.8398 3.8318 4.7297 4.3727 2.9742 3.6103 5.7655 2.3563 2.9667 2.5035 1.4973 3.2233 2.1812 2.5641 4.1078 2.5550 2.9935 9.4050 6.7034 2.9038 3.8650 3.7125 5.1617 13.2939 3.8979 2.9395 2.6129 17.4120 3.1065 3.8982 1.8854 3.7866 3.9540 3.9678 1.4447 2.4991 2.4693 1.4118 1.5248 15.7432 2.8296 3.2757 2.9136 10.1888 1.6626 2.5992 2.8323 4.1262 1.3457 1.7569 3.4907 2.2316 2.1835 3.3275 1.5693 3.4401 1.6692 1.6993 2.0266 1.3994 1.2235 1.1176 1.1230 1.3524 1.1599 1.2342 1.4429 1.2776 1.4737 1.2940 1.2285 1.2304 1.0683 1.0922 1.1034 1.0926 1.0429 1.0439 1.0805 1.0530 1.0514 1.2405 7.1843 8.9224 1.0830 1.0696 1.0628 1.0360 1.0360 1.0637 1.0597 1.0598 1.0947 1.0960 1.0977 1.0974 1.1024 1.1030 1.0978 1.1069 1.1068 1.0770 1.0660
irintensity: 0.1444 0.4754 0.6524 0.4204 0.9522 0.0384 2.9341 0.3754 1.6111 2.1048 1.8570 5.0922 31.0525 1.0268 11.9737 7.1656 29.6578 18.6543 12.4685 59.4773 13.9731 1.9770 14.1679 8.1606 4.3854 14.4788 15.5183 32.8986 0.8395 3.5138 3.2560 42.1870 14.0939 6.3046 51.4665 180.8027 8.7414 40.4415 63.7718 18.1412 9.9143 28.1762 17.2250 7.9981 12.0059 2.5804 8.6942 105.4024 4.9850 43.7378 35.7015 76.5351 7.8534 18.0628 124.8140 2.6409 56.0190 88.8351 9.7423 61.0498 28.0975 133.8985 159.1490 65.4970 14.1220 28.5846 242.9797 19.0532 10.3161 1.6547 4.9594 100.4741 34.8477 84.1595 21.1199 1.0980 22.1874 30.9428 18.6548 20.2315 19.3809 17.8985 15.0686 16.1825 14.5268 14.0014 23.7940 3.6262 25.2889 92.3912 191.2034 195.2092 57.3343 31.5400 5.3745 11.6920 14.8070 6.8167 36.6758 30.4724 12.3129 8.7832 44.1756 33.4535 2.6647 1.6612 5.2917 22.6027 32.5650 337.5912 66.7056
temp: 298.150 k
press: 1.00000 atm
elementType: 16 16 8 8 8 8 8 8 8 7 6 6 6 6 6 6 6 6 6 6 1 1 1 1 1 1 1 1 1 1 1 1 1 1 1 1 1 1 1
symmnumber: 1
zpe: 776452.6 jmol-1
zpe.correction: 0.295735 hartree
zpe.thermalcorrener: 0.320805 hartree
zpe.thermalcorrenthalpy: 0.321749 hartree
zpe.thermalcorrgfe: 0.235315 hartree
zpe.sumelectzpe: -1768.117914 hartree
zpe.sumelectthermal: -1768.092844 hartree
zpe.sumelectthermalent: -1768.091900 hartree
zpe.sumelectthermalfe: -1768.178334 hartree
dipole: 5.2271 0.5642 3.1468
dipole: 6.1272
quadrupole: -147.7015 -112.9195 -138.3336
quadrupole: -12.5328 -1.5608 -2.9356
quadrupole: -14.7166 20.0654 -5.3488 -12.5328 -1.5608 -2.9356
hfenergy: -1768.413649 hartree
pointgroup: C01 [X(C10H19N1O7S2)]
dipole: 2.2948324 -0.7263842 -0.1315036 debye
polarizability: 324.11037|-18.16436|206.773067|97.3378604|-44.9293897|214.4499846 unknown
InChI: InChI=1S/C10H18NO4S.HO3S/c1-3-14-9(12)7-8(11-5-6-16)10(13)15-4-2;1-4(2)3/h8,11H,3-7H2,1-2H3;1H
charge 0 multiplicity 1
39 atoms
S  -3.167656 -1.022095 -1.340633
S  -3.899961 1.083131 -2.398068
O  1.03618 -2.995111 0.640926
O  4.303564 1.771617 0.518769
O  1.61327 -2.073559 2.707641
O  2.054449 2.37897 0.445436
O  -2.95459 0.861517 -3.9876
O  -5.468345 1.180834 -2.779032
O  -3.216859 2.300173 -1.569049
N  0.406955 -0.002133 0.459569
C  1.705662 -0.68027 0.639322
C  2.710614 0.210204 1.414648
C  -0.488129 -0.464767 -0.607644
C  1.469491 -1.963852 1.47028
C  -1.948512 -0.22134 -0.166872
C  2.954183 1.549293 0.74505
C  0.646927 -4.281667 1.311852
C  4.676922 3.079785 -0.119496
C  -0.796579 -4.214492 1.815656
C  4.603213 2.975227 -1.644241
H  2.142587 -0.985858 -0.337328
H  2.296526 0.389346 2.42473
H  3.664566 -0.324405 1.537374
H  0.470851 1.020286 0.569217
H  -0.320552 -1.544572 -0.760162
H  -0.312485 0.040301 -1.582955
H  -2.182803 0.863628 -0.150316
H  -2.14361 -0.628484 0.842219
H  1.355537 -4.467527 2.137744
H  0.778954 -5.032553 0.517237
H  5.704095 3.251413 0.238457
H  3.998611 3.860496 0.26643
H  -1.087132 -5.194532 2.236981
H  -0.901592 -3.456328 2.609693
H  -1.493246 -3.975864 0.993181
H  4.966851 3.9162 -2.096831
H  5.234392 2.149472 -2.015165
H  3.564772 2.814333 -1.978488
H  -3.369022 1.475286 -4.665234
