program: Gaussian 09
title: 000254261
version: EM64L-G09RevD.01
frameworkgroup: C1[X(C12H8BrNO3)]
method: RPBEPBE
basis: SDD
operation: Freq
keyword: #p
keyword: freq=noraman
keyword: PBEPBE/SDD
title: #p freq=noraman PBEPBE/SDD
converged: YES YES NO NO
title: Mulliken charges:
elementType: Br O O O N C C C C C C C C C C C C H H H H H H H H
charge: 0.024463 -0.263169 -0.211725 -0.174160 0.010740 0.249724 0.231171 0.346985 -0.326352 -0.320675 -0.341258 -0.364305 -0.213115 -0.227238 -0.150458 -0.143452 -0.236153 0.278182 0.284550 0.273220 0.274041 0.240699 0.244665 0.255915 0.257703
chargesum: 0.00000
title: Mulliken charges with hydrogens summed into heavy atoms:
elementType: Br O O O N C C C C C C C C C C C C
charge: 0.024463 -0.263169 -0.211725 -0.174160 0.010740 0.249724 0.231171 0.346985 -0.048170 -0.036125 -0.068039 -0.090264 0.027585 0.017427 0.105457 0.114251 -0.236153
polarizability: 2.72492749e+02 -4.46670857e+00 1.47511863e+02 1.53513787e+01 -1.14497407e+01 9.78453691e+01
1716.lowfreq: -1.8286 -0.0005 -0.0004 0.0005 2.9236 4.0931 20.9723 35.0532 42.5066
frequency: 20.9398 35.0340 42.5055 52.0280 108.0192 133.6109 151.5007 193.8263 240.8600 263.3913 294.4792 348.8640 359.5588 392.5552 411.0062 420.1028 488.2699 501.3323 536.2233 581.6796 616.0178 629.4659 646.1019 668.9410 700.5103 727.1467 747.6075 773.3501 784.0417 817.8248 832.8649 858.5401 872.7592 948.2669 961.5578 965.2736 989.4826 992.6239 1037.8910 1055.3267 1065.6089 1103.4349 1140.9723 1156.0745 1173.6366 1183.6642 1206.7100 1232.3049 1265.3780 1285.7366 1362.5924 1366.8880 1387.7294 1393.1552 1437.7061 1458.4436 1467.0458 1580.1026 1581.9592 1594.3936 1606.7839 3145.8950 3155.1349 3163.0455 3165.7706 3172.6114 3175.6009 3184.3850 3186.6307
redmass: 8.5060 5.2073 11.8819 6.4781 7.9458 5.0956 11.5167 7.5387 6.2182 9.6511 6.2485 8.1037 8.1025 6.5120 2.9721 3.9694 3.2432 4.0123 5.8780 6.9038 6.5291 6.4183 7.7816 5.4932 4.0706 4.2675 5.8141 1.4264 6.8887 1.2720 1.5367 4.0330 1.6185 1.3291 1.3619 1.3574 1.3318 4.7766 2.5522 2.5286 3.6168 1.3238 1.8856 1.8651 1.0997 1.4403 7.2888 4.3467 1.5747 1.2481 6.7143 7.8236 7.7657 3.5620 2.6086 2.3156 2.4817 7.2790 6.7317 7.1157 6.8585 1.0869 1.0890 1.0903 1.0891 1.0954 1.0970 1.0979 1.0990
irintensity: 1.9375 0.4707 0.4474 0.4915 1.7914 0.6381 0.1807 0.4947 0.4211 3.7619 0.9375 4.7612 1.7429 2.7796 0.6236 3.0317 29.9482 9.6922 1.6366 6.8151 6.1599 6.3868 8.0030 5.8877 5.7760 20.0125 22.1166 73.8613 12.0323 2.4499 54.9548 26.4762 1.2018 0.7095 1.2335 2.2241 0.4452 93.3588 4.8340 53.4391 17.3574 10.5839 0.5680 50.9204 34.8695 18.0086 399.9325 279.1688 23.6542 0.6208 8.8235 93.9771 9.3911 5.8209 16.9045 409.8302 35.4552 19.0700 29.3538 29.4939 45.0312 3.4961 5.6908 8.1683 2.4606 2.7789 2.1992 0.5270 7.3414
temp: 298.150 k
press: 1.00000 atm
elementType: 35 8 8 8 7 6 6 6 6 6 6 6 6 6 6 6 6 1 1 1 1 1 1 1 1
symmnumber: 1
zpe: 452193.1 jmol-1
zpe.correction: 0.172231 hartree
zpe.thermalcorrener: 0.186772 hartree
zpe.thermalcorrenthalpy: 0.187716 hartree
zpe.thermalcorrgfe: 0.127160 hartree
zpe.sumelectzpe: -754.665196 hartree
zpe.sumelectthermal: -754.650655 hartree
zpe.sumelectthermalent: -754.649711 hartree
zpe.sumelectthermalfe: -754.710267 hartree
dipole: 0.9863 5.3525 0.9918
dipole: 5.5323
quadrupole: -116.3724 -107.8061 -104.7147
quadrupole: -21.3073 -2.5530 -4.4153
quadrupole: -6.7414 1.8249 4.9164 -21.3073 -2.5530 -4.4153
hfenergy: -754.8374269 hartree
pointgroup: C01 [X(C12H8Br1N1O3)]
dipole: -0.2179439 2.1538358 0.2256671 debye
dipolederiv: -0.7689121 0.076168 0.0986777 0.125921 -0.0409588 -0.0276279 0.128213 -0.0224915 -0.0718283 -2.3713718 -0.2497268 -0.0339759 -0.3537631 -0.2670598 -0.0439307 -0.3805265 -0.0721797 -0.2124325 -0.7222728 0.2356965 -0.2274993 0.3370154 -0.6067768 0.0553966 -0.2926676 0.0338749 -0.3952138 -0.3479047 -0.0632522 -0.1742798 0.0129019 -0.655516 -0.1987119 -0.1814959 -0.1259978 -0.410131 0.8476818 -0.2641329 0.4663818 -0.6691734 1.532951 0.1794574 0.4659466 0.150067 0.6036877 1.529081 0.1488321 0.0527932 1.0019169 0.4317033 0.0375517 0.5956228 -0.0342235 0.1082204 -0.2783971 -0.0127433 -0.0603347 0.364792 -0.5596756 -0.0406547 0.0386368 -0.0768343 -0.0331091 1.7871957 0.0619095 -0.061279 -0.3985164 0.0195204 0.0199795 -0.1281729 0.0007347 0.1587789 -0.2169585 -0.0586225 0.0176592 -0.5833014 -0.2596181 -0.0415823 -0.1330283 -0.0122327 -0.1546114 -0.0716415 0.1665633 0.0306563 -0.203487 0.221741 0.0010062 -0.061516 0.1558307 -0.068723 -0.287741 -0.0345538 0.0198837 0.0628166 -0.1183526 0.0229222 0.1286614 0.0323485 -0.0516013 -0.2638335 -0.0470254 -0.0094563 -0.0357435 -0.1098601 0.0643409 -0.0255021 0.0506533 -0.003451 0.3631607 -0.1129419 0.0481918 0.0594908 0.1802198 0.0303654 0.0973285 0.0187024 -0.0920479 -0.188475 0.2001198 0.0470485 0.2919906 -0.2323308 0.0463391 0.01828 0.0512217 -0.1531449 -0.290451 0.0162909 0.0095112 0.0265542 -0.0652879 0.0402973 0.0488498 0.0418357 0.0592707 -0.2808046 0.0580053 0.1299073 0.0421512 -0.0777344 0.0217875 0.1246718 0.0234408 0.0162525 1.2828462 -0.1849463 -0.2117727 -0.2301326 -0.0989249 0.0705741 -0.2587235 0.0657338 -0.0153876 -0.0014181 0.0528522 -0.0317547 0.0974498 0.0880194 -0.010534 -0.0470448 -0.0128595 0.1382411 0.0510711 0.025585 -0.0083503 0.0556824 0.1073385 0.0048087 -0.0236425 -0.0287302 0.1579663 0.0067364 0.001021 -0.0702067 0.0245508 0.1349946 -0.0357947 -0.1071362 -0.0320439 0.0515038 0.0839245 0.0342147 0.0488433 0.0358492 0.1477279 -0.0529161 0.0474319 -0.0457932 0.0268556 0.0855523 0.0326375 -0.004529 0.000566 -0.0822122 -0.0179075 0.0062541 -0.0301102 0.1493064 -0.0255424 -0.0795526 -0.0424476 -0.0755482 0.0233834 -0.0319619 -0.0395404 -0.0456322 0.1541119 0.0633895 0.0124975 0.0383249 0.0175209 0.1379448 -0.0575255 0.0497662 -0.0516208 -0.0045346 0.0150846 -0.0148954 -0.0719928 -0.0075041 0.1487639 -0.0356794 -0.0706664 -0.0336941 0.0420207 unknown
polarizability: 273.1305098|-8.840268|138.221551|9.1456435|22.229755|106.4979201 unknown
InChI: InChI=1S/C12H8BrNO3/c13-9-5-7-10(8-6-9)17-12-4-2-1-3-11(12)14(15)16/h1-8H
charge 0 multiplicity 1
25 atoms
Br -5.889902 0.479216 0.568792
O  0.081256 -0.587521 -0.578883
O  3.73333 -2.191005 0.440238
O  1.991822 -2.422452 -1.01547
N  2.724336 -1.719737 -0.224069
C  1.13231 0.269867 -0.239162
C  2.438154 -0.275498 -0.068929
C  -1.268984 -0.242523 -0.287625
C  0.957007 1.669251 -0.091241
C  3.529467 0.560136 0.265464
C  -1.673362 0.204782 0.990133
C  -2.208538 -0.500778 -1.305883
C  2.052463 2.497551 0.219229
C  3.343869 1.946539 0.404835
C  -3.045972 0.420218 1.242227
C  -3.581784 -0.289286 -1.053093
C  -3.984375 0.175777 0.216702
H  -0.037924 2.10104 -0.233143
H  4.507817 0.093857 0.409813
H  -0.938489 0.369787 1.783999
H  -1.861939 -0.87127 -2.274389
H  1.896608 3.577389 0.312668
H  4.192883 2.591195 0.649643
H  -3.374738 0.761987 2.22754
H  -4.320716 -0.485725 -1.834499
