program: Gaussian 09
title: 000254276
version: EM64L-G09RevD.01
frameworkgroup: C1[X(C15H13N3O3)]
method: RPBEPBE
basis: SDD
operation: Freq
keyword: #p
keyword: freq=noraman
keyword: PBEPBE/SDD
title: #p freq=noraman PBEPBE/SDD
converged: YES YES NO NO
title: Mulliken charges:
elementType: O O O N N N C C C C C C C C C C C C C C C H H H H H H H H H H H H H
charge: -0.260113 -0.214166 -0.212217 -0.181070 0.005559 0.024820 0.283823 0.465687 0.185729 -0.370955 -0.344704 0.382177 -0.297689 -0.350021 -0.360350 -0.360853 -0.367549 -0.662954 -0.249379 -0.226308 -0.222968 0.235005 0.284851 0.254908 0.266697 0.287594 0.287221 0.235002 0.240811 0.293859 0.243807 0.234446 0.234503 0.234796
chargesum: 0.00000
title: Mulliken charges with hydrogens summed into heavy atoms:
elementType: O O O N N N C C C C C C C C C C C C C C C
charge: -0.260113 -0.214166 -0.212217 -0.181070 0.005559 0.024820 0.283823 0.465687 0.185729 -0.135950 -0.059852 0.382177 -0.042781 -0.083324 -0.072756 -0.073632 -0.132546 0.115524 -0.014933 0.008196 0.011828
polarizability: 3.83929167e+02 -1.67268233e+01 2.37019903e+02 -2.00269327e+01 -3.81506107e+00 9.60677941e+01
1716.lowfreq: -3.7232 -2.3993 -0.0006 -0.0004 -0.0002 5.7559 29.1671 29.4857 34.8913
frequency: 29.1536 29.4711 34.8661 59.4780 70.0657 78.3817 109.5759 129.5638 173.9402 184.1269 215.3818 231.8101 252.3173 263.0643 328.3552 338.0913 368.6378 382.5187 403.5917 411.5789 414.2621 432.5726 477.9993 510.1690 514.4679 569.7609 614.1959 621.4391 629.6348 665.4481 668.3219 688.6445 701.1119 734.6729 743.7061 784.1837 792.5945 844.5676 852.7535 866.3723 872.0802 900.9183 920.2105 937.9081 980.5625 990.0167 990.3938 1000.4233 1002.2047 1010.4824 1013.1145 1037.4383 1089.8671 1093.5022 1110.7209 1111.9008 1166.4708 1174.6317 1175.5121 1194.4735 1206.8281 1218.8484 1256.8626 1283.0394 1304.2395 1320.7998 1356.5244 1368.7698 1382.8145 1396.5900 1416.0966 1423.0019 1433.6819 1472.5532 1478.1093 1482.0468 1488.0358 1544.7963 1568.6458 1588.3435 1595.2412 1608.2806 1611.0178 2980.7494 3049.6174 3064.2442 3131.0249 3134.6473 3135.1813 3143.1369 3156.7271 3163.2423 3169.5007 3183.3333 3185.0245 3185.8375
redmass: 5.7986 5.7595 6.6036 5.5526 5.4063 4.7950 5.5072 6.2659 3.4693 4.7688 5.2597 1.9186 2.7212 5.0007 3.2583 4.4215 4.4329 5.1494 2.8351 5.2055 2.9347 6.1007 5.9527 3.5342 5.6080 5.2016 6.4445 7.3259 7.2574 6.2162 4.8652 5.2291 1.5722 5.8898 4.3412 6.9758 2.4580 1.3202 1.2527 3.9238 1.4495 4.9270 1.5889 1.4530 1.3935 1.5097 4.2264 2.9286 1.3462 1.3761 2.5660 1.9672 1.5970 3.2560 1.3232 1.3234 4.8102 1.3841 1.0679 1.1437 2.8082 4.5339 2.2085 2.2427 1.5558 1.3143 6.5105 2.4029 8.7949 2.5064 1.8403 3.7163 2.2290 1.1458 2.1012 2.3886 1.0917 6.0053 7.5360 6.8882 7.2238 6.0455 6.3792 1.0355 1.0870 1.1021 1.0855 1.0975 1.0904 1.0894 1.0943 1.0894 1.0985 1.0948 1.0959 1.0963
irintensity: 1.0573 0.4962 2.8631 1.0728 0.9999 3.4075 3.4939 1.6077 0.7812 0.3488 0.7429 3.1449 1.7415 7.7801 3.1804 1.8142 2.6181 7.3142 0.0710 5.9714 0.1418 9.8969 12.3727 12.4574 2.5582 14.0414 0.5594 8.9840 1.9869 17.8553 30.8117 2.6360 112.8833 2.2355 0.9127 36.7383 18.4537 8.7634 4.5860 12.2914 18.2845 8.2805 62.9465 2.8646 3.8375 0.7252 2.2310 2.5665 1.2237 10.7544 289.9318 128.0664 3.2547 29.2672 12.5953 0.2252 158.7938 168.1056 11.5725 14.3104 5.5146 578.4210 14.6891 251.7267 102.6235 1.2996 173.5115 103.0049 4.4676 83.5700 37.8400 29.2461 15.8474 95.6878 51.4081 18.0199 38.4183 291.7350 36.0990 28.5875 35.6748 14.9198 73.1133 28.2337 36.2737 21.3698 0.2214 1.7170 10.2529 9.9630 16.2863 0.7816 25.1245 0.1782 4.8332 1.3518
temp: 298.150 k
press: 1.00000 atm
elementType: 8 8 8 7 7 7 6 6 6 6 6 6 6 6 6 6 6 6 6 6 6 1 1 1 1 1 1 1 1 1 1 1 1 1
symmnumber: 1
zpe: 666805.1 jmol-1
zpe.correction: 0.253973 hartree
zpe.thermalcorrener: 0.272186 hartree
zpe.thermalcorrenthalpy: 0.273130 hartree
zpe.thermalcorrgfe: 0.205377 hartree
zpe.sumelectzpe: -967.738131 hartree
zpe.sumelectthermal: -967.719917 hartree
zpe.sumelectthermalent: -967.718973 hartree
zpe.sumelectthermalfe: -967.786726 hartree
dipole: 3.3956 -2.7832 0.7527
dipole: 4.4545
quadrupole: -170.8349 -102.9383 -121.2455
quadrupole: 22.2812 -3.7009 -0.8454
quadrupole: -39.1620 28.7346 10.4274 22.2812 -3.7009 -0.8454
hfenergy: -967.9921032 hartree
pointgroup: C01 [X(C15H13N3O3)]
dipole: -1.3963619 -1.0420634 -0.1888117 debye
polarizability: 381.5106553|10.0097702|235.9825177|-37.7723303|1.2076697|99.5236917 unknown
InChI: InChI=1S/C15H13N3O3/c1-17(15(19)13-5-3-2-4-6-13)16-11-12-7-9-14(10-8-12)18(20)21/h2-11H,1H3
charge 0 multiplicity 1
34 atoms
O  -4.413946 -1.560632 0.607592
O  6.372071 -0.086803 -0.356818
O  5.383914 1.949222 -0.057425
N  -2.155566 -1.798782 0.145383
N  -0.927451 -1.181897 0.091233
N  5.332319 0.663893 -0.188994
C  -3.233528 0.506368 0.203027
C  1.477264 -1.222143 -0.064088
C  -3.319231 -0.98551 0.332463
C  2.658258 -1.99806 -0.246847
C  1.594267 0.193223 0.08207
C  4.005402 0.013894 -0.145732
C  -2.389166 1.194616 -0.709049
C  -4.168679 1.247761 0.975655
C  3.924178 -1.389076 -0.289377
C  2.851292 0.813401 0.041351
C  0.176121 -1.899616 -0.028572
C  -2.310116 -3.269234 0.139907
C  -2.473895 2.598208 -0.830462
C  -4.232626 2.651713 0.86973
C  -3.384498 3.332311 -0.035155
H  2.579026 -3.085981 -0.357023
H  0.684899 0.781565 0.235619
H  -1.678984 0.638134 -1.324399
H  -4.84216 0.704231 1.646008
H  4.840788 -1.967757 -0.429182
H  2.964581 1.894899 0.153212
H  0.186428 -2.999147 -0.106128
H  -1.936244 -3.694079 -0.809838
H  -3.382235 -3.483746 0.24995
H  -1.760753 -3.72092 0.98681
H  -1.829163 3.118864 -1.54686
H  -4.946513 3.212449 1.482428
H  -3.438552 4.422832 -0.126484
