program: Gaussian 09
title: 000254256
version: EM64L-G09RevD.01
frameworkgroup: C1[X(C17H10O4)]
method: RPBEPBE
basis: SDD
operation: Freq
keyword: #pfreq=noraman
keyword: PBEPBE/SDD
title: #p freq=noraman PBEPBE/SDD
converged: YES YES NO NO
title: Mulliken charges:
elementType: O O O O C C C C C C C C C C C C C C C C C H H H H H H H H H H
charge: -0.308168 -0.153532 -0.155203 -0.231642 0.478774 0.218480 -0.496862 0.387196 -0.330998 -0.344380 -0.095774 -0.425658 -0.318905 0.061291 0.219634 0.163157 -0.325015 -0.324653 -0.219514 -0.214031 -0.217427 0.317780 0.288390 0.248326 0.265786 0.262286 0.270158 0.266486 0.238983 0.236756 0.238280
chargesum: 0.00000
title: Mulliken charges with hydrogens summed into heavy atoms:
elementType: O O O O C C C C C C C C C C C C C C C C C
charge: -0.308168 -0.153532 -0.155203 -0.231642 0.478774 0.218480 -0.179082 0.387196 -0.042608 -0.096054 -0.095774 -0.159873 -0.056618 0.061291 0.219634 0.163157 -0.054857 -0.058168 0.019470 0.022725 0.020853
polarizability: 3.90924703e+02 5.30664373e+00 1.98348608e+02 1.44977564e-03 1.08730948e-02 7.22712343e+01
1716.lowfreq: -5.9232 -0.0006 0.0008 0.0009 5.8376 6.7915 21.6812 27.7518 55.0117
frequency: 21.1246 27.7135 55.0101 64.1577 64.3331 112.9953 151.6442 158.0218 182.8172 206.6429 280.0372 298.6559 339.6925 341.8200 364.6955 396.1284 402.4307 423.1758 437.8336 441.1749 488.2297 521.4316 533.0435 583.8605 591.0483 614.1915 637.1989 672.6938 681.3333 698.5426 700.6330 703.9064 794.8229 795.5637 807.0201 817.5281 844.7674 863.7962 876.8411 916.7497 935.3600 936.6804 957.6901 990.1103 994.9837 997.7344 1003.9840 1007.2349 1012.3228 1034.1701 1081.1617 1088.8383 1127.3488 1144.6370 1176.8645 1184.6869 1205.3374 1225.5666 1235.5843 1261.6636 1283.8416 1317.6978 1369.7645 1388.3456 1393.1831 1426.5085 1439.8942 1477.5230 1482.5279 1549.0334 1564.2336 1580.4264 1585.6069 1609.1446 1612.0610 1618.6979 1636.5369 3125.0622 3135.7093 3147.6903 3155.8017 3159.3820 3163.5883 3170.9175 3177.7154 3185.1019 3198.6414
redmass: 5.8630 6.0759 8.5429 8.0956 6.4167 7.6406 6.8982 4.6666 5.5950 8.5938 6.1810 7.0527 4.3181 14.9255 6.5764 9.8203 2.8181 3.3135 3.7236 8.7522 7.6542 6.6153 4.1209 6.3312 3.7810 6.4451 7.2384 5.2438 8.0070 1.6637 7.4822 2.7779 8.3238 2.0848 6.7653 2.0670 1.6377 1.2496 2.5020 4.1819 1.4661 8.2046 1.4159 6.3416 1.3804 1.3877 1.3557 5.2114 1.3366 2.1476 2.2853 1.6119 1.3666 1.9254 1.0566 1.1527 2.0994 2.6642 3.1088 2.1949 1.8846 1.3185 2.0111 7.9462 10.0084 3.8023 2.2642 2.2600 2.9784 11.1142 8.9648 7.8654 6.4018 7.7274 6.5740 6.7685 11.3838 1.0886 1.0859 1.0893 1.0893 1.0941 1.0971 1.0986 1.0966 1.0971 1.0931
irintensity: 1.1547 1.1307 2.6458 1.6640 0.8333 2.2465 1.6524 2.4947 0.1527 2.9327 0.0332 7.6444 0.2756 2.7530 7.2572 0.7690 0.0001 1.2811 1.0290 1.6221 3.3819 1.2251 15.2655 4.5201 2.8633 1.7477 14.5981 16.4471 7.1766 69.0521 6.3101 35.4660 12.5096 22.6172 12.2786 22.7154 3.7057 0.1546 35.7801 23.3963 45.3777 38.1047 5.2620 32.9099 0.6657 0.1501 0.3194 465.3657 0.2242 123.3531 43.1446 22.7156 16.0623 392.7150 0.3086 108.8561 95.0999 135.1635 466.7257 115.4274 63.8145 0.7652 6.7492 42.4564 5.2532 4.6141 17.0387 9.9589 66.6276 347.4380 18.6570 124.2484 18.0691 106.2963 1.5181 10.2073 175.8105 6.3621 0.1222 7.6998 0.0774 13.3974 8.0063 24.6473 3.6911 8.0263 7.3672
temp: 298.150 k
press: 1.00000 atm
elementType: 8 8 8 8 6 6 6 6 6 6 6 6 6 6 6 6 6 6 6 6 6 1 1 1 1 1 1 1 1 1 1
symmnumber: 1
zpe: 582999.5 jmol-1
zpe.correction: 0.222053 hartree
zpe.thermalcorrener: 0.238704 hartree
zpe.thermalcorrenthalpy: 0.239648 hartree
zpe.thermalcorrgfe: 0.175473 hartree
zpe.sumelectzpe: -953.268770 hartree
zpe.sumelectthermal: -953.252119 hartree
zpe.sumelectthermalent: -953.251175 hartree
zpe.sumelectthermalfe: -953.315350 hartree
dipole: 8.9028 -0.7747 0.0032
dipole: 8.9365
quadrupole: -140.5825 -110.6718 -122.9367
quadrupole: 16.4018 -0.0009 0.0037
quadrupole: -15.8522 14.0585 1.7936 16.4018 -0.0009 0.0037
hfenergy: -953.490823 hartree
pointgroup: C01 [X(C17H10O4)]
dipole: -3.4959601 -0.1768343 0.3292213 debye
polarizability: 390.9860055|-4.8158481|115.8554009|-1.3972393|-59.8659563|154.7031391 unknown
InChI: InChI=1S/C17H10O4/c18-15-9-6-12-10-13(7-8-14(12)16(15)19)21-17(20)11-4-2-1-3-5-11/h1-10H
charge 0 multiplicity 1
31 atoms
O  -1.440221 0.176819 -0.418617
O  4.82054 1.032054 -1.748174
O  6.396408 -0.368891 0.135218
O  -1.843534 -1.182481 1.466266
C  2.198065 -0.469029 0.380352
C  2.78425 0.290918 -0.679454
C  0.789033 -0.541521 0.514898
C  -0.02512 0.149193 -0.415356
C  1.944044 0.971347 -1.59482
C  3.056709 -1.17933 1.335753
C  4.263878 0.37158 -0.826695
C  0.547003 0.904867 -1.469166
C  4.426529 -1.153633 1.265484
C  5.134302 -0.401482 0.212599
C  -3.709998 -0.23909 0.212675
C  -2.278405 -0.489339 0.520653
C  -4.676506 -0.839348 1.064405
C  -4.130109 0.562942 -0.881806
C  -6.049453 -0.638756 0.822896
C  -5.506194 0.759888 -1.1177
C  -6.466827 0.161048 -0.268192
H  0.336668 -1.119859 1.321374
H  2.41073 1.548325 -2.399542
H  2.559397 -1.748492 2.131074
H  -0.116011 1.423747 -2.166622
H  5.051771 -1.689867 1.987116
H  -4.331169 -1.453655 1.902371
H  -3.380309 1.02036 -1.531982
H  -6.792982 -1.101839 1.479798
H  -5.83119 1.37797 -1.961131
H  -7.535002 0.316654 -0.455374
