program: Gaussian 09
title: 000250310
version: EM64L-G09RevD.01
frameworkgroup: C1[X(C18H18O6)]
method: RPBEPBE
basis: SDD
operation: Freq
keyword: #pfreq=noraman
keyword: PBEPBE/SDD
title: #p freq=noraman PBEPBE/SDD
converged: YES YES NO NO
title: Mulliken charges:
elementType: O O O O O O C C C C C C C C C C C C C C C C C C H H H H H H H H H H H H H H H H H H
charge: -0.324998 -0.315615 -0.259662 -0.387730 -0.349524 -0.229367 0.080487 0.166165 0.243479 -0.667046 0.035407 0.155648 0.270414 -0.551995 0.138779 0.288916 -0.338530 -0.355043 -0.549122 -0.252841 -0.228818 -0.528488 -0.220529 -0.495053 0.311045 0.251304 0.283823 0.286860 0.273515 0.381221 0.259921 0.221706 0.286674 0.233504 0.233241 0.227706 0.256059 0.229621 0.233364 0.233327 0.239927 0.232248
chargesum: 0.00000
title: Mulliken charges with hydrogens summed into heavy atoms:
elementType: O O O O O O C C C C C C C C C C C C C C C C C C
charge: -0.324998 -0.315615 -0.259662 -0.006509 -0.349524 -0.229367 0.080487 0.166165 0.243479 -0.104697 0.035407 0.155648 0.270414 -0.268172 0.138779 0.288916 -0.051670 -0.081527 0.219180 -0.019337 0.004423 0.184898 0.012835 0.210448
polarizability: 3.50712934e+02 -2.11762216e+01 2.11664990e+02 1.42654274e+01 -1.07804502e+01 1.49246322e+02
1716.lowfreq: -9.7854 -3.7229 0.0004 0.0005 0.0006 8.6569 14.4478 33.7641 37.3763
frequency: 14.1543 33.6349 37.3132 58.4932 64.9531 70.7285 87.1160 99.1593 124.1077 129.8223 143.7554 155.3547 162.3031 168.2515 169.3445 189.5580 218.5347 233.6853 250.6596 277.8486 307.0550 317.8980 332.3247 359.2894 388.5849 392.9370 402.9414 415.9588 425.9884 451.4719 475.8694 481.6629 525.4253 536.5299 551.8248 608.8433 613.1042 618.4389 636.9688 679.4691 689.2109 695.0244 717.5314 756.6917 774.6595 815.2253 844.9501 854.0413 860.1265 862.8983 910.2872 941.2199 947.5309 954.2856 978.7414 984.4447 987.9076 995.4851 1009.7475 1022.6558 1042.7944 1046.5982 1088.6702 1105.2414 1111.7992 1119.4475 1126.3556 1148.6818 1150.7673 1160.5146 1164.2935 1174.3776 1182.9667 1194.1744 1233.3859 1257.0808 1269.6469 1324.4018 1332.3875 1349.5139 1360.6774 1387.8785 1388.1607 1418.4143 1428.7669 1435.1940 1440.8896 1451.5576 1454.8279 1455.7813 1457.6985 1459.8384 1470.6639 1480.3742 1481.3034 1481.4654 1512.0329 1561.4116 1564.7540 1592.2432 1609.8799 1634.8397 2637.1158 2973.4930 2995.3848 3001.2607 3049.1341 3073.8503 3112.7140 3112.8390 3119.0196 3125.9233 3127.0212 3129.3082 3132.9535 3141.5284 3153.1794 3162.4234 3170.6775 3195.2454
redmass: 5.6656 5.3807 5.0851 4.1362 3.9998 3.2631 3.7665 5.3571 4.7632 3.8508 3.6147 1.5064 1.2333 2.5340 1.2776 2.3545 3.8442 6.8465 4.5788 4.8000 7.0070 6.5704 5.7326 5.2032 4.8338 4.9175 2.9390 7.9272 4.9135 4.1994 3.9383 6.1656 6.5360 7.0253 4.8383 5.7245 6.2345 4.0344 5.2208 5.3951 5.4533 1.9533 4.1891 3.2520 2.7966 5.2502 5.5673 1.7559 1.2477 6.9049 8.5340 2.3771 2.8856 2.3772 1.6211 1.8101 2.7352 1.8075 1.3565 2.6196 4.9504 2.9845 1.5970 1.2579 1.2483 2.4581 1.2882 1.3892 1.3631 1.8341 1.6048 1.0667 1.7028 1.1492 3.0180 2.3538 1.7800 1.3310 4.5950 4.6944 5.9076 4.2574 4.9318 1.3650 1.3569 2.2272 1.2898 1.1558 1.1668 1.1115 1.1434 1.6898 1.0596 1.0613 1.7740 1.1779 5.4873 5.1017 3.1310 6.4089 6.0104 4.5265 1.0736 1.0303 1.0279 1.0286 1.0592 1.1042 1.1045 1.1065 1.1032 1.1058 1.1051 1.0855 1.1022 1.0888 1.0930 1.0959 1.1011 1.0925
irintensity: 0.7715 2.3954 1.4125 1.2027 5.0660 1.6812 0.8483 1.9976 0.4028 1.6858 2.8407 2.3219 1.4011 2.7223 2.8357 8.8886 1.0155 2.8749 9.0416 30.8200 5.1369 6.9349 3.7635 2.6317 5.1465 8.4404 2.6849 4.7306 9.9305 1.9424 3.4477 0.4714 12.0909 9.3903 22.6382 6.8046 1.8380 3.2993 17.9320 18.1108 37.0091 47.4083 1.4337 12.5806 32.5306 43.2742 3.9509 50.2874 1.2897 1.4619 29.3894 13.7172 100.9378 40.1280 162.3202 46.2185 3.1691 4.2304 3.8657 25.0347 127.0939 23.0473 11.4023 0.2932 1.4963 55.3684 9.1852 2.6489 1.7087 24.2491 37.1052 3.3408 117.8726 91.6339 453.7403 216.3415 212.0255 3.5037 206.4710 151.8192 135.3309 110.6582 42.9721 16.8863 50.9248 23.1246 22.7708 25.7473 48.1373 15.4268 56.6976 93.8624 2.3424 7.5826 1.9540 12.2050 122.8482 53.3961 193.5378 19.3733 16.6404 532.7154 400.4302 62.6323 50.8796 76.3839 25.4799 22.4535 32.4416 3.2974 22.7711 26.1115 14.4672 0.6107 7.0771 12.0568 8.4296 8.6273 37.9768 0.1667
temp: 298.150 k
press: 1.00000 atm
elementType: 8 8 8 8 8 8 6 6 6 6 6 6 6 6 6 6 6 6 6 6 6 6 6 6 1 1 1 1 1 1 1 1 1 1 1 1 1 1 1 1 1 1
symmnumber: 1
zpe: 845394.1 jmol-1
zpe.correction: 0.321994 hartree
zpe.thermalcorrener: 0.345320 hartree
zpe.thermalcorrenthalpy: 0.346264 hartree
zpe.thermalcorrgfe: 0.267738 hartree
zpe.sumelectzpe: -1146.259119 hartree
zpe.sumelectthermal: -1146.235793 hartree
zpe.sumelectthermalent: -1146.234849 hartree
zpe.sumelectthermalfe: -1146.313375 hartree
dipole: 0.8786 -3.5493 -0.4702
dipole: 3.6865
quadrupole: -103.7372 -146.6180 -135.4887
quadrupole: -11.9288 -0.8270 1.3779
quadrupole: 24.8774 -18.0034 -6.8741 -11.9288 -0.8270 1.3779
hfenergy: -1146.5811127 hartree
pointgroup: C01 [X(C18H18O6)]
dipole: 0.2717116 1.382863 0.3427915 debye
polarizability: 348.4903628|29.3654971|215.838877|-8.1250249|-3.7370338|147.2950059 unknown
InChI: InChI=1S/C18H18O6/c1-22-15-10-14(21)16(18(24-3)17(15)23-2)13(20)9-12(19)11-7-5-4-6-8-11/h4-8,10,21H,9H2,1-3H3
charge 0 multiplicity 1
42 atoms
O  1.27387 1.516365 1.33974
O  3.892899 1.480603 0.322228
O  4.809735 -0.938932 -1.057261
O  0.807229 -3.203995 0.041315
O  -1.100954 -2.048596 1.098813
O  -1.674092 1.795412 -0.437639
C  0.885549 -0.803032 0.619801
C  1.720358 0.373408 0.65625
C  -0.50394 -0.890133 1.070911
C  -1.358992 0.312095 1.467711
C  3.042059 0.356343 0.152476
C  1.486684 -2.013831 0.064261
C  3.546934 -0.821677 -0.490877
C  2.772358 -1.995728 -0.50722
C  -2.164519 0.859502 0.26235
C  -3.517442 0.297308 -0.04642
C  -4.020199 -0.879778 0.573104
C  -4.316873 0.975933 -1.01011
C  1.244753 2.800141 0.574238
C  -5.302564 -1.36245 0.233957
C  -5.598952 0.496826 -1.336817
C  4.385951 1.635775 1.714295
C  -6.096283 -0.674558 -0.713044
C  5.512941 0.24226 -1.604816
H  -0.713937 1.12344 1.828948
H  -2.044847 -0.022704 2.262126
H  3.169488 -2.903181 -0.965731
H  -3.394904 -1.438684 1.275834
H  -3.907069 1.873807 -1.484335
H  -0.11877 -3.026788 0.4927
H  2.212454 2.970485 0.076005
H  1.057239 3.574407 1.334161
H  0.406433 2.754719 -0.140951
H  -5.680397 -2.27656 0.704317
H  -6.211835 1.027835 -2.073264
H  4.974403 0.7483 2.014462
H  3.53796 1.780179 2.407091
H  5.027297 2.53059 1.702817
H  -7.094202 -1.049404 -0.967499
H  6.249203 -0.184661 -2.303593
H  6.015571 0.809605 -0.806456
H  4.812407 0.907559 -2.13728
