program: Gaussian 09
title: 000250308
version: EM64L-G09RevD.01
frameworkgroup: C1[X(C9H8BrNO5)]
method: RPBEPBE
basis: SDD
operation: Freq
keyword: #p
keyword: freq=noraman
keyword: PBEPBE/SDD
title: #p freq=noraman PBEPBE/SDD
converged: YES YES NO NO
title: Mulliken charges:
elementType: Br O O O O O N C C C C C C C C C H H H H H H H H
charge: 0.081783 -0.224387 -0.395629 -0.222190 -0.182294 -0.276944 0.024378 0.114523 0.427908 0.063544 0.292762 -0.458536 -0.352811 0.152257 -0.723049 -0.524278 0.308597 0.238103 0.276987 0.242703 0.372034 0.291560 0.247574 0.225406
chargesum: 0.00000
title: Mulliken charges with hydrogens summed into heavy atoms:
elementType: Br O O O O O N C C C C C C C C C
charge: 0.081783 -0.224387 -0.023596 -0.222190 -0.182294 -0.276944 0.024378 0.114523 0.427908 0.063544 0.292762 -0.458536 -0.044215 0.152257 0.034743 0.240262
polarizability: 2.05396421e+02 -1.83733812e+01 2.00357172e+02 -1.41205218e+00 1.64019399e-01 6.58697346e+01
1716.lowfreq: -5.6413 -0.0010 -0.0009 -0.0007 3.9537 5.5121 38.7553 63.5369 81.3319
frequency: 38.7101 63.5232 81.3310 101.5954 116.6496 131.6232 133.5848 155.3447 171.3017 224.9174 238.2967 264.1094 276.0914 311.0724 314.0062 345.2736 369.2707 390.0009 426.4162 471.9971 496.1722 536.7361 584.4516 612.4113 643.8010 670.2494 689.3269 691.3629 754.5855 768.3972 843.2924 915.2768 918.3398 922.9221 971.1027 1015.5714 1047.2039 1080.5576 1110.2227 1144.3523 1153.8210 1205.0120 1226.4703 1298.4114 1307.4782 1356.2585 1373.0080 1376.7876 1388.2841 1433.9572 1443.3840 1450.8520 1458.2342 1465.0851 1493.6238 1544.3040 1587.0904 1601.8599 2694.2192 2990.3363 3000.1083 3093.2269 3105.1776 3120.4597 3140.1563 3187.7515
redmass: 4.2147 8.7555 4.2884 5.8145 1.7734 3.1307 7.8220 5.6013 4.4537 2.8758 6.8464 6.7399 1.8433 2.4427 5.4796 10.8827 7.8552 5.3932 6.2678 6.8053 4.6645 4.4132 4.4946 5.6688 7.8524 10.2542 6.6486 8.4507 8.1936 8.1175 7.5708 1.3288 7.2552 1.0862 2.4156 1.8258 2.6997 6.0146 1.2502 5.2770 1.3895 2.6480 4.1095 7.0377 2.6083 5.7340 1.3579 3.9349 2.7031 1.0979 1.0799 1.2919 1.2505 1.0688 3.3006 4.9528 7.2036 4.6115 1.0696 1.0315 1.0355 1.0956 1.1010 1.1029 1.1059 1.0927
irintensity: 1.2241 0.1906 3.6280 1.8337 0.5501 1.0810 0.8049 12.2212 6.1402 1.8314 2.8736 1.3629 0.1774 4.6387 1.2754 4.5032 13.3863 10.1809 1.1309 1.9120 9.4983 24.0592 8.9177 13.3676 3.5809 27.8702 6.0147 2.7155 8.4624 57.5521 15.2176 0.5592 17.2146 147.4100 2.8357 9.4068 30.2138 14.4740 1.8545 346.9357 20.9297 87.7681 209.9850 355.8073 77.4716 107.3776 81.9156 31.6852 250.3999 46.2923 23.8664 48.4043 26.6958 42.1671 29.8031 120.7795 97.5397 224.3533 231.6710 35.8825 2.8197 6.7695 14.3525 14.7851 12.0304 10.6111
temp: 298.150 k
press: 1.00000 atm
elementType: 35 8 8 8 8 8 7 6 6 6 6 6 6 6 6 6 1 1 1 1 1 1 1 1
symmnumber: 1
zpe: 421903.8 jmol-1
zpe.correction: 0.160695 hartree
zpe.thermalcorrener: 0.176270 hartree
zpe.thermalcorrenthalpy: 0.177214 hartree
zpe.thermalcorrgfe: 0.116709 hartree
zpe.sumelectzpe: -790.807943 hartree
zpe.sumelectthermal: -790.792367 hartree
zpe.sumelectthermalent: -790.791423 hartree
zpe.sumelectthermalfe: -790.851929 hartree
dipole: -1.1604 3.3481 -2.5232
dipole: 4.3500
quadrupole: -105.4876 -107.6194 -102.5912
quadrupole: 6.7782 0.5524 -9.3476
quadrupole: -0.2549 -2.3866 2.6415 6.7782 0.5524 -9.3476
hfenergy: -790.9686374 hartree
pointgroup: C01 [X(C9H8Br1N1O5)]
dipole: -1.5281693 0.1871556 0.7474543 debye
dipolederiv: 0.0187913 0.0472107 -0.0162579 0.1118812 -0.5615111 0.1817336 -0.0126981 0.146302 -0.0235089 -1.6573555 0.3711789 -0.103218 0.4154839 -0.3516297 0.0297903 -0.2310518 0.1283652 -0.2900317 -0.5076697 0.0996453 -0.0535028 0.0979517 -1.0285696 0.222561 -0.044665 0.1948683 -0.3982371 -0.7518472 -0.2806617 -0.2143224 -0.1619383 -0.477934 0.0591746 -0.2671565 -0.0587051 -0.6548334 -1.0963493 -0.1119434 -0.107253 -0.4896222 -0.4151701 -0.016621 -0.0020849 0.0384826 -0.2225771 -0.5873988 0.0650374 -0.0658158 0.4310803 -0.9373683 0.2480805 -0.1861598 0.2025635 -0.364046 2.2211664 -0.2360406 0.3740419 -0.2012264 1.0089552 -0.2592881 0.3927056 -0.2675448 0.3396008 -0.6260632 -0.1395801 -0.0937166 -0.0519027 -0.7466166 0.1198169 -0.0906744 0.204685 -0.2149375 1.5136586 -0.2832972 0.1328935 -0.2972933 0.3722527 0.0462029 0.1579024 -0.1606856 0.1914317 0.847918 -0.2038979 0.1550162 0.029817 0.8786928 -0.2355214 0.1657423 -0.1669794 0.2307145 -1.210426 0.0934342 -0.2074712 0.3486942 -0.3201657 0.1288069 -0.2999009 0.1075934 -0.0742869 -0.8619324 -0.0558088 -0.0412409 -0.3221222 1.0614187 -0.418456 0.0760173 -0.3753347 -0.0787601 0.2831222 -0.0601376 0.0512835 -0.477392 -0.0792399 -0.0428613 0.1634543 -0.0010155 0.0130383 0.9131822 0.7219526 0.2385213 0.6693187 0.972476 -0.2625579 0.2051338 -0.1602833 0.7138251 0.0209482 -0.0162726 0.0086291 -0.1235068 -0.4276438 0.280636 0.032346 0.1984386 -0.1223791 0.8660795 -0.0994269 -0.0348087 0.1216362 0.1958221 0.0002204 -0.1826896 0.0082334 0.2304135 0.1082715 -0.0584799 0.0083984 0.0213064 0.11167 0.0179746 -0.0214277 0.016214 0.1590005 0.0878477 -0.0395825 -0.0426462 -0.0224691 0.0643657 -0.0870302 -0.0411717 -0.0501978 -0.0549644 0.0888342 0.0861757 0.0380692 0.0530416 0.0830159 -0.0291276 0.0411464 -0.023514 0.0872337 -0.092169 -0.1093311 0.0198326 -0.0351164 0.1066459 0.0090765 -0.0252489 0.0284673 0.0705201 0.4414392 0.1254157 -0.0105913 -0.0577392 0.4296843 -0.0267297 0.0311194 -0.0002843 0.3569043 0.0349534 -0.0195116 0.0058192 -0.1277796 0.0720487 -0.064305 0.0130264 -0.0601366 0.0475847 -0.0277884 0.063396 0.0189275 0.1275106 -0.048971 -0.0047665 0.0617112 -0.0135955 0.1310823 -0.0272127 0.0405255 -0.0605875 -0.0596139 0.0377718 0.1031903 0.0646241 0.0640631 -0.0727872 unknown
polarizability: 209.1254461|-8.8281426|182.4975884|25.8362673|-34.7774739|80.0002928 unknown
InChI: InChI=1S/C9H8BrNO5/c1-4(12)7-8(13)6(11(14)15)3-5(10)9(7)16-2/h3,13H,1-2H3
charge 0 multiplicity 1
24 atoms
Br -0.09115 3.762502 -1.146319
O  -2.159349 1.673436 -0.72926
O  0.715359 -2.064667 0.652601
O  -2.634678 -1.297746 -1.279399
O  3.955304 0.545715 0.444926
O  3.148477 -1.535999 0.920541
N  2.9721 -0.274692 0.522471
C  -0.783841 -0.327754 -0.099923
C  -0.971356 1.0431 -0.478019
C  0.527732 -0.764441 0.269069
C  1.634337 0.147357 0.179921
C  0.170198 1.919104 -0.58755
C  1.446235 1.480204 -0.26647
C  -1.876793 -1.362472 -0.266846
C  -2.049917 -2.465798 0.760787
C  -3.483126 1.183701 -0.301782
H  2.314286 2.140608 -0.328985
H  -1.760493 -2.147204 1.775364
H  -1.395408 -3.316348 0.49885
H  -3.097628 -2.808937 0.736941
H  1.733799 -2.169987 0.846949
H  -3.88211 0.482331 -1.050267
H  -4.092763 2.0966 -0.235088
H  -3.418514 0.688388 0.68449
