program: Gaussian 09
title: 000250307
version: EM64L-G09RevD.01
frameworkgroup: C1[X(C9H16N4O2)]
method: RPBEPBE
basis: SDD
operation: Freq
keyword: #p
keyword: freq=noraman
keyword: PBEPBE/SDD
title: #p freq=noraman PBEPBE/SDD
converged: YES YES NO NO
title: Mulliken charges:
elementType: O O N N N N C C C C C C C C C H H H H H H H H H H H H H H H H
charge: -0.260877 -0.247207 -0.106879 -0.170196 -0.626499 -0.627931 -0.306013 -0.458866 -0.455310 -0.487183 0.071627 0.253437 -0.266422 -0.665328 0.249211 0.272488 0.230794 0.216243 0.250770 0.213299 0.248980 0.231563 0.219996 0.234418 0.213714 0.249397 0.225220 0.329859 0.305460 0.299704 0.362528
chargesum: 0.00000
title: Mulliken charges with hydrogens summed into heavy atoms:
elementType: O O N N N N C C C C C C C C C
charge: -0.260877 -0.247207 -0.106879 -0.170196 0.008821 0.034301 -0.033526 -0.011828 0.008760 -0.006639 0.071627 0.253437 0.187993 0.023003 0.249211
polarizability: 1.84625229e+02 2.12455152e+01 1.55026341e+02 5.49641890e+00 -5.86025285e+00 9.32907532e+01
1716.lowfreq: -3.7988 -0.0006 -0.0002 0.0001 7.3690 9.5036 20.3172 37.4745 48.5757
frequency: 19.7185 37.1880 48.5720 69.2958 92.5339 102.1496 107.4227 151.6999 162.7597 203.5977 235.7331 247.9587 267.7552 302.7494 326.1078 355.7292 378.8921 412.6711 435.0303 476.6084 490.0173 525.2697 565.5397 584.3558 642.8401 655.3766 685.6296 730.8119 742.5123 777.8579 811.4533 828.4236 844.7837 854.8446 899.2052 903.5610 921.0645 981.9706 1002.8995 1016.8030 1042.5014 1052.0326 1063.4870 1092.8776 1103.3318 1111.1415 1128.8273 1155.3053 1166.5110 1193.3540 1227.6842 1230.3579 1276.1998 1276.8091 1293.3271 1314.8965 1323.1013 1355.0092 1388.5506 1445.3385 1455.4106 1461.5311 1466.5263 1477.2724 1484.7316 1488.1011 1529.9159 1589.3979 1611.7708 1624.3298 1636.9354 2983.7900 2991.3532 3002.2108 3019.0022 3027.7458 3051.1425 3062.9028 3071.9104 3086.2256 3089.0199 3090.6283 3116.6314 3467.1632 3547.5007 3666.1988 3697.1163
redmass: 4.2721 4.1515 3.1835 4.4209 3.8155 3.7115 4.0354 4.2651 2.4062 1.3996 1.6949 2.1039 1.7362 2.9864 3.5615 3.0410 4.4136 1.3132 3.4485 2.5451 2.9713 1.2296 3.4210 2.8724 2.6613 3.5848 5.2193 1.5501 4.9547 1.9896 1.7386 2.3055 2.1647 3.3157 1.9569 3.6090 3.1717 1.9843 2.3892 2.7979 1.5310 1.6918 2.2298 2.3575 2.2885 2.2516 1.4574 1.6858 1.7902 2.9517 1.5100 1.4519 1.4079 1.1282 1.5332 1.4459 1.3692 1.3085 1.2354 1.0806 1.0969 1.0444 1.0876 1.0991 1.0512 2.4743 2.4311 1.8164 2.6612 2.9278 4.2285 1.0659 1.0360 1.0631 1.0622 1.0589 1.0942 1.0856 1.1007 1.0976 1.1048 1.1033 1.1059 1.0495 1.0449 1.0978 1.1036
irintensity: 0.9140 1.1375 0.4093 1.3135 1.8713 6.5745 6.6669 6.7574 4.1707 2.5132 62.2020 5.4661 60.2814 7.4021 9.3416 37.7395 7.0797 261.1593 5.9907 26.1113 6.3892 150.3642 9.3760 3.6212 22.1066 5.0722 3.7875 140.3494 4.1718 7.3329 1.7183 0.2706 10.6994 0.2788 13.7875 34.3344 26.8488 10.8129 2.0809 41.5367 3.7729 9.6655 35.1797 116.2532 132.2073 85.9187 61.1921 19.0643 14.7135 21.1302 2.0210 3.0604 5.7124 2.9980 57.1421 8.3572 17.1252 4.5574 24.5580 14.9894 12.8982 13.3562 8.4445 20.3613 11.7020 31.7431 339.8573 440.0629 43.6897 447.7538 184.3928 10.4582 24.0529 34.4202 48.6553 25.9543 12.5972 8.7234 24.5225 37.1984 38.2858 2.2973 32.9579 45.5026 56.6072 57.3694 28.5426
temp: 298.150 k
press: 1.00000 atm
elementType: 8 8 7 7 7 7 6 6 6 6 6 6 6 6 6 1 1 1 1 1 1 1 1 1 1 1 1 1 1 1 1
symmnumber: 1
zpe: 669529.0 jmol-1
zpe.correction: 0.255010 hartree
zpe.thermalcorrener: 0.271423 hartree
zpe.thermalcorrenthalpy: 0.272367 hartree
zpe.thermalcorrgfe: 0.209396 hartree
zpe.sumelectzpe: -720.830170 hartree
zpe.sumelectthermal: -720.813757 hartree
zpe.sumelectthermalent: -720.812813 hartree
zpe.sumelectthermalfe: -720.875784 hartree
dipole: -2.5622 -3.1149 0.9403
dipole: 4.1414
quadrupole: -67.6622 -74.9477 -91.6613
quadrupole: 5.9251 5.9793 1.7565
quadrupole: 10.4282 3.1427 -13.5709 5.9251 5.9793 1.7565
hfenergy: -721.0851803 hartree
pointgroup: C01 [X(C9H16N4O2)]
dipole: -0.9189523 -1.2551335 0.4847724 debye
polarizability: 181.495543|23.5443493|156.6657915|3.7566167|-11.1696283|94.7809892 unknown
InChI: InChI=1S/C9H16N4O2/c1-2-15-8(14)6-4-3-5-7(6)12-13-9(10)11/h6H,2-5,10-11H2,1H3
charge 0 multiplicity 1
31 atoms
O  2.138964 -1.005686 0.524149
O  2.422973 0.539281 -1.201889
N  -1.209039 -0.060137 0.379029
N  -2.518362 0.011256 -0.193067
N  -4.511729 -1.202155 -0.335826
N  -2.620531 -2.233634 0.66732
C  0.964294 1.083113 0.737789
C  1.294859 2.597833 0.618106
C  0.505395 3.077587 -0.632435
C  -0.816609 2.267103 -0.591244
C  -0.464788 0.994499 0.16756
C  1.912481 0.225481 -0.099708
C  3.009096 -1.974195 -0.212483
C  4.483149 -1.748513 0.136482
C  -3.182748 -1.13168 0.054599
H  0.99279 0.700405 1.770886
H  2.378125 2.789574 0.533126
H  0.924472 3.111991 1.525396
H  1.07725 2.822498 -1.541305
H  0.335434 4.168591 -0.62591
H  -1.232239 2.031182 -1.58696
H  -1.619228 2.80273 -0.045041
H  2.648713 -2.958624 0.127337
H  2.830828 -1.854325 -1.295498
H  5.106376 -2.52363 -0.347446
H  4.821256 -0.76164 -0.221558
H  4.642924 -1.80777 1.22709
H  -4.88992 -0.368197 -0.78046
H  -4.965578 -2.097088 -0.49848
H  -3.179426 -2.977104 1.07545
H  -1.649381 -2.080945 0.957892
